2(1H)-Quinolinone

Gas phase thermochemistry data

Data compiled by: Hussein Y. Afeefy, Joel F. Liebman, and Stephen E. Stein

Quantity Value Units Method Reference Comment
Δfgas-25.5 ± 2.4kJ/molCcbRibeiro da Silva, Matos, et al., 1990

Phase change data

Data compiled as indicated in comments:
ALS - Hussein Y. Afeefy, Joel F. Liebman, and Stephen E. Stein
AC - William E. Acree, Jr., James S. Chickos

Quantity Value Units Method Reference Comment
Δsub28.5 ± 0.1kcal/molVRibeiro da Silva, Matos, et al., 1990ALS
Δsub28.5 ± 0.1kcal/molMERibeiro da Silva, Matos, et al., 1990Based on data from 375. - 390. K.; AC

Enthalpy of sublimation

ΔsubH (kcal/mol) Temperature (K) Method Reference Comment
27.5 ± 0.1383.MERibeiro da Silva, Matos, et al., 1990Based on data from 375. - 390. K.; AC

References

Ribeiro da Silva, Matos, et al., 1990
Ribeiro da Silva, M.A.V.; Matos, M.A.R.; Monte, M.J.S., Enthalpies of combustion, vapour pressures, and enthalpies of sublimation of 2-hydroxyquinoline, 4-methyl-2-hydroxyquinoline, 4-hydroxyquinoline, and 2-methyl-4-hydroxyquinoline, J. Chem. Thermodyn., 1990, 22, 609-616. [all data]