Pentafluoropropionyl hypofluorite
- Formula: C3F6O
- Molecular weight: 166.0219
- CAS Registry Number: 5930-63-2

Phase change data

Data compiled by: William E. Acree, Jr., James S. Chickos
Enthalpy of vaporization
ΔvapH (kJ/mol) | Temperature (K) | Method | Reference | Comment |
---|---|---|---|---|
25.8 | 233. | A | Stephenson and Malanowski, 1987 | Based on data from 214. to 248. K. |

References

Stephenson and Malanowski, 1987
Stephenson, Richard M.; Malanowski, Stanislaw,
Handbook of the Thermodynamics of Organic Compounds, 1987, https://doi.org/10.1007/978-94-009-3173-2
. [all data]