Folic Acid

Normal alkane RI, non-polar column, temperature ramp

View large format table.

Column type Active phase I Reference Comment
CapillaryDB-51387.Rahimi-Nasrabadi, Gholivand, et al., 200930. m/0.25 mm/0.25 μm, Nitrogen, 40. C @ 1. min, 3. K/min, 250. C @ 10. min

References

Rahimi-Nasrabadi, Gholivand, et al., 2009
Rahimi-Nasrabadi, M.; Gholivand, M.B.; Batooli, H.; Vatanara, A., Chemical composition of the essential oil from leaves and flowering aerial parts of Psammogeton canscens (DC). Vake from Iran, J. Medicinal Plants, 2009, 8, 31, 82-86. [all data]