1-Tetralol
- Formula: C10H12O
- Molecular weight: 148.2017
- IUPAC Standard InChIKey: JAAJQSRLGAYGKZ-UHFFFAOYSA-N
- CAS Registry Number: 5929-35-1
- Chemical structure:
View 3d structure (requires JavaScript / HTML 5) - Species with the same structure:

Condensed phase thermochemistry data

Data compiled by: Hussein Y. Afeefy, Joel F. Liebman, and Stephen E. Stein
Quantity | Value | Units | Method | Reference | Comment |
---|---|---|---|---|---|
ΔfH°solid | -285.3 ± 5.4 | kJ/mol | Ccb | Breitenbach and Derkosch, 1951 | Reanalyzed by Cox and Pilcher, 1970, Original value = -285. kJ/mol |
Quantity | Value | Units | Method | Reference | Comment |
ΔcH°solid | -5364.7 | kJ/mol | Ccb | Breitenbach and Derkosch, 1951 | Corresponding ΔfHºsolid = -285. kJ/mol (simple calculation by NIST; no Washburn corrections) |

References

Breitenbach and Derkosch, 1951
Breitenbach, J.W.; Derkosch, J.,
Verbrennungswarmen von peroxyden und verwandten verbindungen sowie von polystrolen,
Monatsh. Chem., 1951, 82, 177-179. [all data]
Cox and Pilcher, 1970
Cox, J.D.; Pilcher, G.,
Thermochemistry of Organic and Organometallic Compounds, Academic Press, New York, 1970, 1-636. [all data]