Diallyl sulfide
- Formula: C6H10S
- Molecular weight: 114.209
- IUPAC Standard InChIKey: UBJVUCKUDDKUJF-UHFFFAOYSA-N
- CAS Registry Number: 592-88-1
- Chemical structure:
View 3d structure (requires JavaScript / HTML 5) - Other names: Allyl sulfide; 1-Propene, 3,3'-thiobis-; Allyl monosulfide; Diallyl monosulfide; Diallyl thioether; Oil garlic; Thioallyl ether; (CH2=CHCH2)2S; 2-Propenyl sulphide; 3,3-Thiobis(1-propene); Allyl sulphide; di-2-Propenyl sulfide; Diallyl sulphide; Prop-1-ene-3,3'-thiobis; NSC 20947; Diallylsulfane; 3-(Allylsulfanyl)-1-propene; 132879-26-6

Condensed phase thermochemistry data

Data compiled by: Hussein Y. Afeefy, Joel F. Liebman, and Stephen E. Stein
Quantity | Value | Units | Method | Reference | Comment |
---|---|---|---|---|---|
ΔcH°liquid | -1068.1 | kcal/mol | Ccb | Berthelot, 1901 |

Phase change data

Data compiled as indicated in comments:
BS - Robert L. Brown and Stephen E. Stein
TRC - Thermodynamics Research Center, NIST Boulder Laboratories, Chris Muzny director
AC - William E. Acree, Jr., James S. Chickos
Quantity | Value | Units | Method | Reference | Comment |
---|---|---|---|---|---|
Tboil | 411.2 | K | N/A | Aldrich Chemical Company Inc., 1990 | BS |
Tboil | 411. | K | N/A | American Tokyo Kasei, 1988 | BS |
Tboil | 412. | K | N/A | Brandsma and Wijers, 1963 | Uncertainty assigned by TRC = 3. K; TRC |
Enthalpy of vaporization
ΔvapH (kcal/mol) | Temperature (K) | Method | Reference | Comment |
---|---|---|---|---|
11.1 | 278. | N/A | Dykyj, Svoboda, et al., 1999 | Based on data from 263. to 411. K.; AC |
10.3 | 278. | A | Stephenson and Malanowski, 1987 | Based on data from 263. to 412. K. See also Stull, 1947.; AC |
Antoine Equation Parameters
log10(P) = A − (B / (T + C))
P = vapor pressure (atm)
T = temperature (K)
View plot Requires a JavaScript / HTML 5 canvas capable browser.
Temperature (K) | A | B | C | Reference | Comment |
---|---|---|---|---|---|
263.7 to 411.8 | 4.38296 | 1634.989 | -38.588 | Stull, 1947 | Coefficents calculated by NIST from author's data. |
283. to 313. | 2.70211 | 951.402 | -91.19 | Bauer and Burschkies, 1935 | Coefficents calculated by NIST from author's data. |

Gas phase ion energetics data

Data compiled by: Sharon G. Lias, Rhoda D. Levin, and Sherif A. Kafafi

Ionization energy determinations

IE (eV) Method Reference
8.52 ± 0.01PITrofimov, Mel'der, et al., 1975

Van Den Dool and Kratz RI, non-polar column, temperature ramp

Data compiled by: NIST Mass Spectrometry Data Center, William E. Wallace, director

Column type CapillaryCapillaryCapillaryCapillary
Active phase DB-5DB-1DB-5DB-1
Column length (m) 30.30.60.60.
Carrier gas HeHeHeHe
Substrate
Column diameter (mm) 0.320.320.250.25
Phase thickness (μm) 0.5  1.0
Tstart (C) 40.60.40.40.
Tend (C) 265.250.200.260.
Heat rate (K/min) 7.4.4.2.
Initial hold (min)  4.10.5.
Final hold (min) 5.  60.
I 862.850.871.850.
ReferenceMahattanatawee K., Perez-Cacho P.R., et al., 2007Pino, Fuentes, et al., 2001Kim, Wu, et al., 1995Yu, Lin, et al., 1994
Comment MSDC-RI MSDC-RI MSDC-RI MSDC-RI

Normal alkane RI, polar column, custom temperature program

Data compiled by: NIST Mass Spectrometry Data Center, William E. Wallace, director

Column type CapillaryCapillaryCapillary
Active phase Carbowax 20MSupelcowax-10DB-Wax
Column length (m)
Carrier gas
Substrate
Column diameter (mm)
Phase thickness (μm)
Program not specifiednot specifiednot specified
I 1150.1142.1151.
ReferenceVinogradov, 2004Jung, Kim, et al., 2001Peng, Yang, et al., 1991
Comment MSDC-RI MSDC-RI MSDC-RI

Kovats' RI, non-polar column, temperature ramp

Data compiled by: NIST Mass Spectrometry Data Center, William E. Wallace, director

Column type Capillary
Active phase SE-54
Column length (m) 30.
Carrier gas He
Substrate
Column diameter (mm) 0.25
Phase thickness (μm) 0.25
Tstart (C) 50.
Tend (C) 230.
Heat rate (K/min) 4.
Initial hold (min) 3.
Final hold (min)
I 850.
ReferenceZoghbi, Ramos, et al., 1984
Comment MSDC-RI

Normal alkane RI, non-polar column, custom temperature program

Data compiled by: NIST Mass Spectrometry Data Center, William E. Wallace, director

Column type CapillaryCapillaryCapillaryCapillaryCapillary
Active phase SPB-1HP-5 MSSE-30HP-5MSHP-5
Column length (m) 30.30. 30.30.
Carrier gas Helium  HeHe
Substrate
Column diameter (mm) 0.320.25 0.250.25
Phase thickness (μm) 0.250.25 0.250.25
Program not specified40 0C (3 min) 2 0C/min -> 150 0C 20 0C/min -> 220 0C (5 min)not specified40C (10min) => 3C/min => 120C => 10C/min => 250C (5min)40C (10min) => 3C/min => 120C => 10C/min => 250C (5min)
I 854.831.854.848.848.
ReferenceRao, Nagender, et al., 2007Pyun and Shin, 2006Vinogradov, 2004Ansorena, Gimeno, et al., 2001Ansorena, Astiasarán, et al., 2000
Comment MSDC-RI MSDC-RI MSDC-RI MSDC-RI MSDC-RI
Column type CapillaryCapillaryCapillaryCapillary
Active phase CP Sil 5 CBDB-5DB-5DB-5
Column length (m) 50.50.50.50.
Carrier gas HeHeHeHe
Substrate
Column diameter (mm) 0.320.320.320.32
Phase thickness (μm) 1.20.250.250.25
Program 33C (16.5min) => 2C/min => 160C => 20C/min => 200C (9min)40C (10min) => 3C/min => 95C => 10C/min => 270C (10min)40C (10min) => 3C/min => 95C => 10C/min => 270C (10min)40C (10min) => 3C/min => 95C => 10C/min => 270C (10min)
I 848.867.865.863.
ReferenceGijs, Piraprez, et al., 2000Mateo and Zumalacárregui, 1996Mateo and Zumalacárregui, 1996Mateo and Zumalacárregui, 1996
Comment MSDC-RI MSDC-RI MSDC-RI MSDC-RI

Kovats' RI, non-polar column, isothermal

Data compiled by: NIST Mass Spectrometry Data Center, William E. Wallace, director

Column type CapillaryCapillaryCapillaryCapillaryPacked
Active phase DB-5DB-5DB-5DB-5Apiezon M
Column length (m) 30.30.30.30.2.1
Carrier gas     He or N2
Substrate     Chromosorb W, AW-DMCS
Column diameter (mm) 0.250.250.250.25
Phase thickness (μm) 0.10.10.10.1
Temperature (C) 100.120.60.80.130.
I 864.6871.6856.2860.3854.
ReferenceMiller and Bruno, 2003Miller and Bruno, 2003Miller and Bruno, 2003Miller and Bruno, 2003Garbuzov, Misharina, et al., 1985
Comment MSDC-RI MSDC-RI MSDC-RI MSDC-RI MSDC-RI
Column type Packed
Active phase Apiezon M
Column length (m) 2.1
Carrier gas
Substrate Chromosorb W, AW-DMCS
Column diameter (mm)
Phase thickness (μm)
Temperature (C) 130.
I 854.
ReferenceGolovnya, Misharina, et al., 1978
Comment MSDC-RI

References

Berthelot, 1901
Berthelot, M.,
Chimie Organique. - Nouvelles recherches sur l'isomerie des ethers sulfocyaniques,
Compt. Rend., 1901, 132, 57-58. [all data]
Aldrich Chemical Company Inc., 1990
Aldrich Chemical Company Inc.,
Catalog Handbook of Fine Chemicals, Aldrich Chemical Company, Inc., Milwaukee WI, 1990, 1. [all data]
American Tokyo Kasei, 1988
American Tokyo Kasei,
TCI American Organic Chemical 88/89 Catalog, American Tokyo Kasei, Portland, OR, 1988, 1610. [all data]
Brandsma and Wijers, 1963
Brandsma, L.; Wijers, H.,
A Simple Laboratory Scale Preparation Method for Dialkyl Sulfides, Selenides, Telluridles, Thiols and Selenols,
Recl. Trav. Chim. Pays-Bas, 1963, 82, 68. [all data]
Dykyj, Svoboda, et al., 1999
Dykyj, J.; Svoboda, J.; Wilhoit, R.C.; Frenkel, M.L.; Hall, K.R.,
Vapor Pressure of Chemicals: Part A. Vapor Pressure and Antoine Constants for Hydrocarbons and Sulfur, Selenium, Tellurium and Hydrogen Containing Organic Compounds, Springer, Berlin, 1999, 373. [all data]
Stephenson and Malanowski, 1987
Stephenson, Richard M.; Malanowski, Stanislaw,
Handbook of the Thermodynamics of Organic Compounds, 1987, https://doi.org/10.1007/978-94-009-3173-2
. [all data]
Stull, 1947
Stull, Daniel R.,
Vapor Pressure of Pure Substances. Organic and Inorganic Compounds,
Ind. Eng. Chem., 1947, 39, 4, 517-540, https://doi.org/10.1021/ie50448a022
. [all data]
Bauer and Burschkies, 1935
Bauer, H.; Burschkies, K.,
Sattigungsdrucke einiger Senfole und Sulfide,
Ber. Dtsch. Chem. Ges., 1935, 68, 6, 1238-1243, https://doi.org/10.1002/cber.19350680645
. [all data]