Butane, 1-isothiocyanato-

Van Den Dool and Kratz RI, non-polar column, custom temperature program

Data compiled by: NIST Mass Spectrometry Data Center, William E. Wallace, director

Column type CapillaryCapillary
Active phase HP-5DB-5
Column length (m) 30.25.
Carrier gas HeHe
Substrate
Column diameter (mm) 0.250.25
Phase thickness (μm) 0.250.25
Program 5C(5min) => 3C/min => 20C => 5C/min => 100C 15C/min => 150C (5min)60C => 3C/min => 106C => 6C/min => 280C
I 946.943.
ReferenceEngel, Baty, et al., 2002Afsharypuor, Jeiran, et al., 1998
Comment MSDC-RI MSDC-RI

Kovats' RI, non-polar column, isothermal

Data compiled by: NIST Mass Spectrometry Data Center, William E. Wallace, director

Column type Packed
Active phase UCW-98
Column length (m) 1.8
Carrier gas N2
Substrate Chromosorb WAW DNCS
Column diameter (mm)
Phase thickness (μm)
Temperature (C) 120.
I 979.3
ReferenceRajniaková and Floch, 1993
Comment MSDC-RI

References

Engel, Baty, et al., 2002
Engel, E.; Baty, C.; le Corre, D.; Souchon, I.; Martin, N., Flavor-active compounds potentially implicated in cooked cauliflower acceptance, J. Agric. Food Chem., 2002, 50, 22, 6459-6467, https://doi.org/10.1021/jf025579u . [all data]

Afsharypuor, Jeiran, et al., 1998
Afsharypuor, S.; Jeiran, K.; Jazy, A.A., First investigation of the flavour profiles of the leaf, ripe fruit and root of Capparis spinosa var. mucronifolia from Iran, Pharm. Acta Helv., 1998, 72, 5, 307-309, https://doi.org/10.1016/S0031-6865(97)00023-X . [all data]