2-Butenoic acid, 4-[(4-bromophenyl)amino]-4-oxo, (Z)-
- Formula: C10H8BrNO3
- Molecular weight: 270.079
- IUPAC Standard InChIKey: DSNFUZCLEZJCRN-WAYWQWQTSA-N
- CAS Registry Number: 59256-47-2
- Chemical structure:
View 3d structure (requires JavaScript / HTML 5) - Permanent link for this species. Use this link for bookmarking this species for future reference.

Reaction thermochemistry data

Data compiled by: Hussein Y. Afeefy, Joel F. Liebman, and Stephen E. Stein
Individual Reactions
By formula: C6H6BrN + C4H2O3 = C10H8BrNO3
Quantity | Value | Units | Method | Reference | Comment |
---|---|---|---|---|---|
ΔrH° | 14. | kJ/mol | Cm | Srivastava, 1979 | solid phase |

References

Srivastava, 1979
Srivastava, A.K.,
Solid-state reactions between maleic anhydride and substituted aromactic amines,
Z. Phys. Chem. (Leipzig), 1979, 260, 630-640. [all data]