Carbonochloridic acid, butyl ester
- Formula: C5H9ClO2
- Molecular weight: 136.577
- IUPAC Standard InChIKey: NRDQFWXVTPZZAZ-UHFFFAOYSA-N
- CAS Registry Number: 592-34-7
- Chemical structure:
View 3d structure (requires JavaScript / HTML 5) - Other names: Formic acid, chloro-, butyl ester; Butyl chlorocarbonate; Butyl chloroformate; Chloroformic acid butyl ester; n-Butyl chloroformate; Butoxycarbonyl chloride; UN 2743; NSC 8428; Butyl chloridocarbonate

Phase change data

Data compiled by: Robert L. Brown and Stephen E. Stein
Quantity | Value | Units | Method | Reference | Comment |
---|---|---|---|---|---|
Tboil | 415.2 | K | N/A | Weast and Grasselli, 1989 |

Normal alkane RI, non-polar column, custom temperature program

Column type | Active phase | I | Reference | Comment |
---|---|---|---|---|
Capillary | Polydimethyl siloxanes | 832. | Zenkevich, Eliseenkov, et al., 2006 | Program: not specified |
Capillary | Polydimethyl siloxanes | 832. | Zenkevich, 2001 | Program: not specified |

References

Weast and Grasselli, 1989
CRC Handbook of Data on Organic Compounds, 2nd Editon, Weast,R.C and Grasselli, J.G., ed(s)., CRC Press, Inc., Boca Raton, FL, 1989, 1. [all data]
Zenkevich, Eliseenkov, et al., 2006
Zenkevich, I.G.; Eliseenkov, E.V.; Kasatochkin, A.N.,
Application of Retention Indices in GC-MS Identification of Halogenated Organic Compounds,
Mass Spectromery (Rus.), 2006, 3, 2, 131-140. [all data]
Zenkevich, 2001
Zenkevich, I.G.,
Encyclopedia of Chromatography. Derivatization of Acids for GC Analysis, Marcel Dekker, Inc., New York - Basel, 2001, 221. [all data]