D-Galactose
- Formula: C6H12O6
- Molecular weight: 180.1559
- IUPAC Standard InChIKey: GZCGUPFRVQAUEE-KCDKBNATSA-N
- CAS Registry Number: 59-23-4
- Chemical structure:
- Other names: Galactose, D-; D-(+)-Galactose; Galactose
- Comments:
- Although only a single structure is shown, this species may exist in several forms including a linear molecule, a five membered ring and a six membered ring.

Condensed phase thermochemistry data

Data compiled by: Eugene S. Domalski and Elizabeth D. Hearing
Quantity | Value | Units | Method | Reference | Comment |
---|---|---|---|---|---|
S°solid,1 bar | 205.4 | J/mol*K | N/A | Jack and Stegeman, 1941 | crystaline, α phase; Extrapolation below 90 K, 48.95 J/mol*K. |
Constant pressure heat capacity of solid
Cp,solid (J/mol*K) | Temperature (K) | Reference | Comment |
---|---|---|---|
216.3 | 300. | Kawaizumi, Nishio, et al., 1981 | T = 270 to 325 K. Cp given as 1.20 J/g*K. |
220.54 | 296.9 | Jack and Stegeman, 1941 | crystaline, α phase; T = 64 to 297 K. Value is unsmoothed experimental datum. |

Phase change data

Data compiled by: William E. Acree, Jr., James S. Chickos
Enthalpy of fusion
ΔfusH (kJ/mol) | Temperature (K) | Reference |
---|---|---|
43.8 | 436.2 | Jónsdóttir, Cooke, et al., 2002 |

References

Jack and Stegeman, 1941
Jack, G.W.; Stegeman, G.,
The heat capacities and entropies of two monosaccharides,
J. Am. Chem. Soc., 1941, 63, 2121-2123. [all data]
Kawaizumi, Nishio, et al., 1981
Kawaizumi, F.; Nishio, N.; Nomura, H.; Miyahara, Y.,
Heat-capacity measurements of aqueous solutions of mono-, di-, and tri-saccharides using an isoperibol twin calorimeter,
J. Chem. Thermodynam., 1981, 13, 89-98. [all data]
Jónsdóttir, Cooke, et al., 2002
Jónsdóttir, Svava Ósk; Cooke, Stephen A.; Macedo, Eugénia A.,
Modeling and measurements of solid--liquid and vapor--liquid equilibria of polyols and carbohydrates in aqueous solution,
Carbohydrate Research, 2002, 337, 17, 1563-1571, https://doi.org/10.1016/S0008-6215(02)00213-6
. [all data]