Cadmium, diethyl-
- Formula: C4H10Cd
- Molecular weight: 170.533
- CAS Registry Number: 592-02-9

Gas phase thermochemistry data

Data compiled by: José A. Martinho Simões
Quantity | Value | Units | Method | Reference | Comment |
---|---|---|---|---|---|
ΔfH°gas | 134.2 ± 3.4 | kJ/mol | Review | Martinho Simões | |
ΔfH°gas | 100.8 ± 7.3 | kJ/mol | Review | Martinho Simões | |
ΔfH°gas | 105.3 ± 1.9 | kJ/mol | Review | Martinho Simões | Selected data |

Condensed phase thermochemistry data

Data compiled by: José A. Martinho Simões
Quantity | Value | Units | Method | Reference | Comment |
---|---|---|---|---|---|
ΔfH°liquid | 54.8 ± 7.3 | kJ/mol | Review | Martinho Simões | |
ΔfH°liquid | 59.3 ± 1.9 | kJ/mol | Review | Martinho Simões | Selected data |
Quantity | Value | Units | Method | Reference | Comment |
ΔfH°solid | 88.2 ± 3.4 | kJ/mol | Review | Martinho Simões | |
Quantity | Value | Units | Method | Reference | Comment |
ΔcH°solid | -3349.7 ± 3.3 | kJ/mol | CC-SB | Lautsch, Erzberger, et al., 1958 | Please also see Cox and Pilcher, 1970. |

Phase change data

Data compiled as indicated in comments:
MS - José A. Martinho Simões
AC - William E. Acree, Jr., James S. Chickos
Quantity | Value | Units | Method | Reference | Comment |
---|---|---|---|---|---|
ΔvapH° | 46.0 ± 0.4 | kJ/mol | RSC | Sokolovskii and Baev, 1985 | MS |
Quantity | Value | Units | Method | Reference | Comment |
ΔsubH° | 46.0 ± 0.4 | kJ/mol | CC-SB | Sokolovskii and Baev, 1985 | MS |
Enthalpy of vaporization
ΔvapH (kJ/mol) | Temperature (K) | Reference | Comment |
---|---|---|---|
46.0 ± 0.4 | 324. | Sokolovski and Baev, 1985 | Based on data from 286. to 362. K. See also Baev, 2001.; AC |

Gas phase ion energetics data

Data compiled as indicated in comments:
LLK - Sharon G. Lias, Rhoda D. Levin, and Sherif A. Kafafi
Ionization energy determinations
IE (eV) | Method | Reference | Comment |
---|---|---|---|
8.0 | PE | Creber and Bancroft, 1980 | LLK |
8.2 | PE | Creber and Bancroft, 1980 | Vertical value; LLK |

References

Martinho Simões
Martinho Simões, J.A.,
Private communication (see http://webbook.nist.gov/chemistry/om/). [all data]
Lautsch, Erzberger, et al., 1958
Lautsch, W.F.; Erzberger, P.; Tröber, A.,
Wiss. Z. Tech. Hochsch. Chem. Leuna-Merseburg, 1958, 1, 31. [all data]
Cox and Pilcher, 1970
Cox, J.D.; Pilcher, G.,
Thermochemistry of Organic and Organometallic Compounds
in Academic Press, New York, 1970. [all data]
Sokolovskii and Baev, 1985
Sokolovskii, A.E.; Baev, A.K.,
Vestsi Akad. Navuk BSSR, Ser. Khim. Navuk, 1985, 112.. [all data]
Sokolovski and Baev, 1985
Sokolovski, A.E.; Baev, A.K.,
Vestsi Akad. G. Emii Navuk BSSR Ser. Khim. Navuk, 1985, 1112. [all data]
Baev, 2001
Baev, A.K.,
Izv. Vyssh. Uchebn. Zaved., Khim. Khim. Tekhnol., 2001, 44, 1, 3. [all data]