2-Butene, 1-chloro-
- Formula: C4H7Cl
- Molecular weight: 90.551
- IUPAC Standard InChIKey: YTKRILODNOEEPX-UHFFFAOYSA-N
- CAS Registry Number: 591-97-9
- Chemical structure:
View 3d structure (requires JavaScript / HTML 5) - Stereoisomers:
- Other names: α-Chloro-β-butylene; γ-Methallyl chloride; γ-Methylallyl chloride; Crotyl chloride; 1-Chloro-2-butene; 2-Butenyl chloride; 1-chlorobut-2-ene

Gas phase thermochemistry data

Data compiled by: Hussein Y. Afeefy, Joel F. Liebman, and Stephen E. Stein
Quantity | Value | Units | Method | Reference | Comment |
---|---|---|---|---|---|
ΔfH°gas | -49.37 | kJ/mol | Eqk | Levanova, Rodova, et al., 1974 |

Phase change data

Data compiled by: Thermodynamics Research Center, NIST Boulder Laboratories, Chris Muzny director
Quantity | Value | Units | Method | Reference | Comment |
---|---|---|---|---|---|
Tboil | 357.4 | K | N/A | Vernon, 1954 | Uncertainty assigned by TRC = 1. K |
Tboil | 357.15 | K | N/A | Henne, Chanan, et al., 1941 | Uncertainty assigned by TRC = 2. K |
Tboil | 357.15 | K | N/A | Henne, Chanan, et al., 1941 | Uncertainty assigned by TRC = 2. K |
Tboil | 357.15 | K | N/A | Henne, Chanan, et al., 1941 | Uncertainty assigned by TRC = 2. K |
Tboil | 356.15 | K | N/A | Henne, Chanan, et al., 1941 | Uncertainty assigned by TRC = 2. K |

Reaction thermochemistry data

Data compiled by: Hussein Y. Afeefy, Joel F. Liebman, and Stephen E. Stein
Individual Reactions
By formula: C4H7Cl = C4H7Cl
Quantity | Value | Units | Method | Reference | Comment |
---|---|---|---|---|---|
ΔrH° | -4. | kJ/mol | Eqk | Levanova, Rodova, et al., 1975 | gas phase |

References

Levanova, Rodova, et al., 1974
Levanova, S.V.; Rodova, R.M.; Rozhnov, A.M.; Shevtsova, L.A.,
Thermodynamic calculation of the equilibrium composition of chlorobutene mixtures,
Russ. J. Phys. Chem. (Engl. Transl.), 1974, 48, 1113-1114. [all data]
Vernon, 1954
Vernon, C.A.,
J. Chem. Soc., 1954, 1954, 423. [all data]
Henne, Chanan, et al., 1941
Henne, A.L.; Chanan, H.H.; Turk, A.,
Olefins and Diolefins from Allylic Chlorides,
J. Am. Chem. Soc., 1941, 63, 3474-6. [all data]
Levanova, Rodova, et al., 1975
Levanova, S.V.; Rodova, R.M.; Shevtsova, L.A.; Rozhnov, A.M.,
Isomerisation of chlorobutenes,
Russ. J. Phys. Chem. (Engl. Transl.), 1975, 49, 41-43. [all data]