Butanoic acid, 4-hydroxy-

Reaction thermochemistry data

Data compiled by: Hussein Y. Afeefy, Joel F. Liebman, and Stephen E. Stein

Individual Reactions

Butanoic acid, 4-hydroxy- = Water + Butyrolactone

By formula: C4H8O3 = H2O + C4H6O2

Quantity Value Units Method Reference Comment
Δr4.5 ± 0.2kJ/molCmWiberg and Waldron, 1991liquid phase

Condensed phase thermochemistry data

Data compiled by: Hussein Y. Afeefy, Joel F. Liebman, and Stephen E. Stein

Quantity Value Units Method Reference Comment
Δfliquid-710. ± 3.kJ/molCmWiberg and Waldron, 1991

References

Wiberg and Waldron, 1991
Wiberg, K.B.; Waldron, R.F., Lactones. 2. Enthalpies of hydrolysis, reduction, and formation of the C4-C13 monocyclic lactones. strain energies and conformations, J. Am. Chem. Soc., 1991, 113, 7697-7705. [all data]