4-Pentenoic acid
- Formula: C5H8O2
- Molecular weight: 100.1158
- IUPAC Standard InChIKey: HVAMZGADVCBITI-UHFFFAOYSA-N
- CAS Registry Number: 591-80-0
- Chemical structure:
View 3d structure (requires JavaScript / HTML 5) - Other names: Allylacetic acid; Pent-4-enoic acid; δ4-Pentenoic acid; 4 PA

Condensed phase thermochemistry data

Data compiled by: Hussein Y. Afeefy, Joel F. Liebman, and Stephen E. Stein
Quantity | Value | Units | Method | Reference | Comment |
---|---|---|---|---|---|
ΔcH°liquid | -2680.3 ± 2.5 | kJ/mol | Ccb | Schjanberg, 1937 | Reanalyzed by Cox and Pilcher, 1970, Original value = -2680. ± 10. kJ/mol; At 293 K; Corresponding ΔfHºliquid = -430.62 kJ/mol (simple calculation by NIST; no Washburn corrections) |

Phase change data

Data compiled as indicated in comments:
BS - Robert L. Brown and Stephen E. Stein
TRC - Thermodynamics Research Center, NIST Boulder Laboratories, Chris Muzny director
AC - William E. Acree, Jr., James S. Chickos
Quantity | Value | Units | Method | Reference | Comment |
---|---|---|---|---|---|
Tboil | 461.7 | K | N/A | Weast and Grasselli, 1989 | BS |
Quantity | Value | Units | Method | Reference | Comment |
Tc | 659.75 | K | N/A | D'Souza and Teja, 1987 | Uncertainty assigned by TRC = 3. K; Ambrose's procedure; TRC |
Quantity | Value | Units | Method | Reference | Comment |
Pc | 40.7447 | bar | N/A | D'Souza and Teja, 1987 | Uncertainty assigned by TRC = 1.00 bar; Ambrose's procedure; TRC |
Quantity | Value | Units | Method | Reference | Comment |
ΔvapH° | 65.8 ± 0.4 | kJ/mol | GS | Emel'yanenko, Verevkin, et al., 2008 | Based on data from 289. to 324. K.; AC |
Reduced pressure boiling point
Tboil (K) | Pressure (bar) | Reference | Comment |
---|---|---|---|
356.7 | 0.016 | Aldrich Chemical Company Inc., 1990 | BS |

Reaction thermochemistry data

Data compiled by: John E. Bartmess
Individual Reactions
C5H7O2- + =
By formula: C5H7O2- + H+ = C5H8O2
Quantity | Value | Units | Method | Reference | Comment |
---|---|---|---|---|---|
ΔrH° | 1441. ± 12. | kJ/mol | G+TS | Graul, Schnute, et al., 1990 | gas phase |
Quantity | Value | Units | Method | Reference | Comment |
ΔrG° | 1411. ± 12. | kJ/mol | CIDC | Graul, Schnute, et al., 1990 | gas phase |

Gas phase ion energetics data

Data compiled by: John E. Bartmess
De-protonation reactions
C5H7O2- + =
By formula: C5H7O2- + H+ = C5H8O2
Quantity | Value | Units | Method | Reference | Comment |
---|---|---|---|---|---|
ΔrH° | 1441. ± 12. | kJ/mol | G+TS | Graul, Schnute, et al., 1990 | gas phase |
Quantity | Value | Units | Method | Reference | Comment |
ΔrG° | 1411. ± 12. | kJ/mol | CIDC | Graul, Schnute, et al., 1990 | gas phase |

References

Schjanberg, 1937
Schjanberg, E.,
Die verbrennungswarmen und die refraktionsdaten einiger pentensaureeste,
Z. Phys. Chem., 1937, 178, 274-281. [all data]
Cox and Pilcher, 1970
Cox, J.D.; Pilcher, G.,
Thermochemistry of Organic and Organometallic Compounds, Academic Press, New York, 1970, 1-636. [all data]
Weast and Grasselli, 1989
CRC Handbook of Data on Organic Compounds, 2nd Editon, Weast,R.C and Grasselli, J.G., ed(s)., CRC Press, Inc., Boca Raton, FL, 1989, 1. [all data]
D'Souza and Teja, 1987
D'Souza, R.; Teja, A.S.,
The prediction of the vapor pressures of carboxylic acids,
Chem. Eng. Commun., 1987, 61, 13. [all data]
Emel'yanenko, Verevkin, et al., 2008
Emel'yanenko, V.N.; Verevkin, S.P.; Burakova, E.N.; Roganov, G.N.; Georgieva, M.K.,
The thermodynamic properties of 4-pentenoic acid,
Russ. J. Phys. Chem. A, 2008, 82, 9, 1521-1526, https://doi.org/10.1134/S0036024408090215
. [all data]
Aldrich Chemical Company Inc., 1990
Aldrich Chemical Company Inc.,
Catalog Handbook of Fine Chemicals, Aldrich Chemical Company, Inc., Milwaukee WI, 1990, 1. [all data]
Graul, Schnute, et al., 1990
Graul, S.T.; Schnute, M.E.; Squires, R.R.,
Gas-Phase Acidities of Carboxylic Acids and Alcohols from Collision-Induced Dissociation of Dimer Cluster Ions,
Int. J. Mass Spectrom. Ion Proc., 1990, 96, 2, 181, https://doi.org/10.1016/0168-1176(90)87028-F
. [all data]