Phenol, 3,5-dichloro-
- Formula: C6H4Cl2O
- Molecular weight: 163.001
- IUPAC Standard InChIKey: VPOMSPZBQMDLTM-UHFFFAOYSA-N
- CAS Registry Number: 591-35-5
- Chemical structure:
View 3d structure (requires JavaScript / HTML 5) - Other names: 3,5-Dichlorophenol

Gas phase thermochemistry data

Data compiled by: Hussein Y. Afeefy, Joel F. Liebman, and Stephen E. Stein
Quantity | Value | Units | Method | Reference | Comment |
---|---|---|---|---|---|
ΔfH°gas | -148.2 ± 1.5 | kJ/mol | Ccr | Ribeiro Da Silva, Ferrao, et al., 1994 | HCl (1:600 H2O) |

Condensed phase thermochemistry data

Data compiled by: Hussein Y. Afeefy, Joel F. Liebman, and Stephen E. Stein
Quantity | Value | Units | Method | Reference | Comment |
---|---|---|---|---|---|
ΔfH°solid | -231.0 ± 1.0 | kJ/mol | Ccr | Ribeiro Da Silva, Ferrao, et al., 1994 | HCl (1:600 H2O) |
Quantity | Value | Units | Method | Reference | Comment |
ΔcH°solid | -2749.1 ± 0.6 | kJ/mol | Ccr | Ribeiro Da Silva, Ferrao, et al., 1994 | HCl (1:600 H2O) |

Phase change data

Data compiled as indicated in comments:
BS - Robert L. Brown and Stephen E. Stein
TRC - Thermodynamics Research Center, NIST Boulder Laboratories, Chris Muzny director
ALS - Hussein Y. Afeefy, Joel F. Liebman, and Stephen E. Stein
AC - William E. Acree, Jr., James S. Chickos
DH - Eugene S. Domalski and Elizabeth D. Hearing
Quantity | Value | Units | Method | Reference | Comment |
---|---|---|---|---|---|
Tboil | 506.2 | K | N/A | Weast and Grasselli, 1989 | BS |
Quantity | Value | Units | Method | Reference | Comment |
Tfus | 341.0 | K | N/A | Poeti, Faneli, et al., 1982 | Uncertainty assigned by TRC = 0.2 K; TRC |
Quantity | Value | Units | Method | Reference | Comment |
ΔsubH° | 82.8 ± 1.1 | kJ/mol | C | Ribeiro Da Silva, Ferrao, et al., 1994 | HCl (1:600 H2O); ALS |
ΔsubH° | 82.8 ± 1.1 | kJ/mol | C | da Silva, 1994 | AC |
Reduced pressure boiling point
Tboil (K) | Pressure (bar) | Reference | Comment |
---|---|---|---|
396.2 | 0.01 | Weast and Grasselli, 1989 | BS |
Enthalpy of sublimation
ΔsubH (kJ/mol) | Temperature (K) | Reference | Comment |
---|---|---|---|
71.8 | 284. | Stephenson and Malanowski, 1987 | Based on data from 273. to 295. K.; AC |
Enthalpy of fusion
ΔfusH (kJ/mol) | Temperature (K) | Reference | Comment |
---|---|---|---|
20.509 | 341.0 | Poeti, Fanelli, et al., 1982 | DH |
20.51 | 341. | Domalski and Hearing, 1996 | AC |
Entropy of fusion
ΔfusS (J/mol*K) | Temperature (K) | Reference | Comment |
---|---|---|---|
60.14 | 341.0 | Poeti, Fanelli, et al., 1982 | DH |

Reaction thermochemistry data

Data compiled by: John E. Bartmess
Individual Reactions
C6H3Cl2O- + =
By formula: C6H3Cl2O- + H+ = C6H4Cl2O
Quantity | Value | Units | Method | Reference | Comment |
---|---|---|---|---|---|
ΔrH° | 1399. ± 8.8 | kJ/mol | G+TS | Fujio, McIver, et al., 1981 | gas phase; value altered from reference due to change in acidity scale |
Quantity | Value | Units | Method | Reference | Comment |
ΔrG° | 1370. ± 8.4 | kJ/mol | IMRE | Fujio, McIver, et al., 1981 | gas phase; value altered from reference due to change in acidity scale |

Gas phase ion energetics data

Data compiled by: John E. Bartmess
De-protonation reactions
C6H3Cl2O- + =
By formula: C6H3Cl2O- + H+ = C6H4Cl2O
Quantity | Value | Units | Method | Reference | Comment |
---|---|---|---|---|---|
ΔrH° | 1399. ± 8.8 | kJ/mol | G+TS | Fujio, McIver, et al., 1981 | gas phase; value altered from reference due to change in acidity scale |
Quantity | Value | Units | Method | Reference | Comment |
ΔrG° | 1370. ± 8.4 | kJ/mol | IMRE | Fujio, McIver, et al., 1981 | gas phase; value altered from reference due to change in acidity scale |

Kovats' RI, non-polar column, isothermal

View large format table.

Column type Active phase Temperature (C) I Reference Comment
CapillarySE-30160.1375.Evans and Haken, 1989Column length: 25. m; Column diameter: 0.32 mm
CapillarySE-30140.1358.Korhonen, 1984
CapillarySE-30160.1375.Korhonen, 1984
CapillarySE-30180.1392.Korhonen, 1984

Kovats' RI, non-polar column, custom temperature program

View large format table.

Column type Active phase I Reference Comment
PackedSE-301391.Grzybowski, Lamparczyk, et al., 1980Chromosorb W HMDS (80-100 mesh); Column length: 2.9 m; Program: not specified

Kovats' RI, polar column, isothermal

View large format table.

Column type Active phase Temperature (C) I Reference Comment
CapillaryFFAP160.2675.Evans and Haken, 1989Column length: 25. m; Column diameter: 0.35 mm
CapillaryFFAP160.2675.Korhonen, 1984
CapillaryFFAP180.2691.Korhonen, 1984
CapillaryFFAP200.2713.Korhonen, 1984

Van Den Dool and Kratz RI, non-polar column, temperature ramp

View large format table.

Column type Active phase I Reference Comment
CapillarySE-301367.Korhonen, 198410. K/min; Tstart: 100. C
CapillarySE-301362.Korhonen, 19842. K/min; Tstart: 100. C
CapillarySE-301362.Korhonen, 19846. K/min; Tstart: 100. C

Van Den Dool and Kratz RI, non-polar column, custom temperature program

View large format table.

Column type Active phase I Reference Comment
CapillaryVF-5MS1399.9Tret'yakov, 200730. m/0.25 mm/0.25 μm, He; Program: Multi-step temperature program; T(initial)=60C; T(final)=270C

Van Den Dool and Kratz RI, polar column, temperature ramp

View large format table.

Column type Active phase I Reference Comment
CapillaryFFAP2707.Korhonen, 198410. K/min; Tstart: 100. C
CapillaryFFAP2670.Korhonen, 19842. K/min; Tstart: 100. C
CapillaryFFAP2700.Korhonen, 19846. K/min; Tstart: 100. C

Normal alkane RI, non-polar column, temperature ramp

View large format table.

Column type Active phase I Reference Comment
CapillaryUltra-11370.Okumura, 199125. m/0.32 mm/0.25 μm, He, 3. K/min; Tstart: 80. C; Tend: 260. C

Normal alkane RI, non-polar column, custom temperature program

View large format table.

Column type Active phase I Reference Comment
CapillaryPTE-51400.Nakano, Fujimori, et al., 199225. m/0.20 mm/0.33 μm; Program: 50 0C (2 min) 30 0C/min -> 200 0C 8 0C/min -> 280 0C (10 min)
CapillaryUltra-21395.Nakano, Fujimori, et al., 199225. m/0.20 mm/0.33 μm; Program: 50 0C (2 min) 30 0C/min -> 200 0C 8 0C/min -> 280 0C (10 min)
CapillarySE-301391.Peterson, 1992Program: not specified
CapillaryOV-1, SE-30, Methyl silicone, SP-2100, OV-101, DB-1, etc.1391.Waggott and Davies, 1984Hydrogen; Column length: 50. m; Column diameter: 0.32 mm; Program: not specified

References

Ribeiro Da Silva, Ferrao, et al., 1994
Ribeiro Da Silva, M.A.V.; Ferrao, M.L.C.C.H.; Jiye, F.,
Standard enthalpies of combustion of the six dichlorophenols by rotating-bomb calorimetry,
J. Chem. Thermodyn., 1994, 26, 839-846. [all data]
Weast and Grasselli, 1989
CRC Handbook of Data on Organic Compounds, 2nd Editon, Weast,R.C and Grasselli, J.G., ed(s)., CRC Press, Inc., Boca Raton, FL, 1989, 1. [all data]
Poeti, Faneli, et al., 1982
Poeti, G.; Faneli, E.; Braghetti, M.J.,
A differential scanning calorimetric study of some phenol derivatives,
Therm. Anal., 1982, 24, 2, 273, https://doi.org/10.1007/BF01913681
. [all data]
da Silva, 1994
da Silva, M.,
Standard enthalpies of combustion of the six dichlorophenols by rotating-bomb calorimetry,
The Journal of Chemical Thermodynamics, 1994, 26, 8, 839-846, https://doi.org/10.1006/jcht.1994.1100
. [all data]
Stephenson and Malanowski, 1987
Stephenson, Richard M.; Malanowski, Stanislaw,
Handbook of the Thermodynamics of Organic Compounds, 1987, https://doi.org/10.1007/978-94-009-3173-2
. [all data]
Poeti, Fanelli, et al., 1982
Poeti, G.; Fanelli, E.; Braghetti, M.,
A differential scanning calorimetric study of some phenol derivatives,
J. Therm. Anal., 1982, 24(2), 273-279. [all data]
Domalski and Hearing, 1996
Domalski, Eugene S.; Hearing, Elizabeth D.,
Heat Capacities and Entropies of Organic Compounds in the Condensed Phase. Volume III,
J. Phys. Chem. Ref. Data, 1996, 25, 1, 1, https://doi.org/10.1063/1.555985
. [all data]
Fujio, McIver, et al., 1981
Fujio, M.; McIver, R.T., Jr.; Taft, R.W.,
Effects on the acidities of phenols from specific substituent-solvent interactions. Inherent substituent parameters from gas phase acidities,
J. Am. Chem. Soc., 1981, 103, 4017. [all data]