Benzaldehyde, 3-methoxy-

Condensed phase thermochemistry data

Data compiled by: Hussein Y. Afeefy, Joel F. Liebman, and Stephen E. Stein

Quantity Value Units Method Reference Comment
Δcliquid-4015.4 ± 7.5kJ/molCcbManzoni-Ansidei and Storto, 1940Reanalyzed by Cox and Pilcher, 1970, Original value = -4019.9 kJ/mol; Corresponding Δfliquid = -276.0 kJ/mol (simple calculation by NIST; no Washburn corrections)

Phase change data

Data compiled by: Robert L. Brown and Stephen E. Stein

Quantity Value Units Method Reference Comment
Tboil503.KN/AAmerican Tokyo Kasei, 1988

Reduced pressure boiling point

Tboil (K) Pressure (bar) Reference
416.20.067Aldrich Chemical Company Inc., 1990

Gas phase ion energetics data

Data evaluated as indicated in comments:
HL - Edward P. Hunter and Sharon G. Lias

Data compiled as indicated in comments:
B - John E. Bartmess

Quantity Value Units Method Reference Comment
Proton affinity (review)844.1kJ/molN/AHunter and Lias, 1998HL
Quantity Value Units Method Reference Comment
Gas basicity812.2kJ/molN/AHunter and Lias, 1998HL

Electron affinity determinations

EA (eV) Method Reference Comment
0.429 ± 0.043ECDWentworth, Kao, et al., 1975B

References

Manzoni-Ansidei and Storto, 1940
Manzoni-Ansidei, R.; Storto, T., Experimentelle beitrage zum problem der chelatringbildung. IX. Thermochemische untersuchungen an einigen methoxybenzaldehyden, Atti. R. Acad. Italia. Rend. Classe Sci. Fis. Mat. Nat., 1940, 1, 465. [all data]

Cox and Pilcher, 1970
Cox, J.D.; Pilcher, G., Thermochemistry of Organic and Organometallic Compounds, Academic Press, New York, 1970, 1-636. [all data]

American Tokyo Kasei, 1988
American Tokyo Kasei, TCI American Organic Chemical 88/89 Catalog, American Tokyo Kasei, Portland, OR, 1988, 1610. [all data]

Aldrich Chemical Company Inc., 1990
Aldrich Chemical Company Inc., Catalog Handbook of Fine Chemicals, Aldrich Chemical Company, Inc., Milwaukee WI, 1990, 1. [all data]