Phenol, 2-methoxy-4-(1-propenyl)-, (Z)-
- Formula: C10H12O2
- Molecular weight: 164.2011
- IUPAC Standard InChIKey: BJIOGJUNALELMI-ARJAWSKDSA-N
- CAS Registry Number: 5912-86-7
- Chemical structure:
View 3d structure (requires JavaScript / HTML 5) - Stereoisomers:
- Other names: Phenol, 2-methoxy-4-propenyl-, (Z)-; cis-Isoeugenol; cis-2-Methoxy-4-propenylphenol; Isoeugenol, Z-; 2-Methoxy-4-[(1Z)-1-propenyl]phenol; 4-(1-Propenyl)-2-methoxyphenol, (Z)-; (Z)-Isoeugenol; (Z)-2-Methoxy-4-(prop-1-enyl)phenol; cis-4-Propenylguaiacol; 1-(2-furanyl)-2-hydroxyethanone; (Z)-2-Methoxy-5-(1-propenyl)phenol

Phase change data

Data compiled by: William E. Acree, Jr., James S. Chickos
Enthalpy of vaporization
ΔvapH (kJ/mol) | Temperature (K) | Method | Reference | Comment |
---|---|---|---|---|
69.7 | 388. | A | Stephenson and Malanowski, 1987 | Based on data from 373. to 403. K. |

Van Den Dool and Kratz RI, non-polar column, temperature ramp

Data compiled by: NIST Mass Spectrometry Data Center, William E. Wallace, director

Column type CapillaryCapillaryCapillaryCapillary
Active phase BP-1HP-5MSDB-5DB-5
Column length (m) 50.30.30.30.
Carrier gas HeHeHeHe
Substrate
Column diameter (mm) 0.220.250.260.25
Phase thickness (μm) 0.250.250.250.25
Tstart (C) 60.60.60.70.
Tend (C) 220.280.246.230.
Heat rate (K/min) 2.4.3.4.
Initial hold (min)  5. 2.
Final hold (min) 20.  20.
I 1379.1392.1407.1397.
ReferenceDuquesnoy, Dinh, et al., 2006Saroglou, Dorizas, et al., 2006Adams, Habte, et al., 2004Choi, Kim. M.-S.L., et al., 2002
Comment MSDC-RI MSDC-RI MSDC-RI MSDC-RI

Van Den Dool and Kratz RI, non-polar column, custom temperature program

Data compiled by: NIST Mass Spectrometry Data Center, William E. Wallace, director

Column type CapillaryCapillary
Active phase DB-5MSDB-5MS
Column length (m) 30.30.
Carrier gas HeHe
Substrate
Column diameter (mm) 0.320.32
Phase thickness (μm) 0.50.5
Program 70C => 5C/min => 85C(1min) => 3C/min => 165C => 10C/min => 280C(3min)70C(1min) => 3C/min => 80C(1min) => 5C/min => 150C => 10C/min => 280C (4min)
I 1423.1423.
ReferenceVarlet, Serot, et al., 2007Varlet V., Knockaert C., et al., 2006
Comment MSDC-RI MSDC-RI

Normal alkane RI, polar column, temperature ramp

Data compiled by: NIST Mass Spectrometry Data Center, William E. Wallace, director

Column type CapillaryCapillary
Active phase FFAPZB-Wax
Column length (m) 30.60.
Carrier gas N2He
Substrate
Column diameter (mm) 0.320.32
Phase thickness (μm) 0.50.5
Tstart (C) 35.40.
Tend (C) 320.250.
Heat rate (K/min) 4.3.
Initial hold (min) 5.2.
Final hold (min) 45.10.
I 2256.2288.
ReferenceNebesny, Budryn, et al., 2007Wierda R.L., Fletcher G., et al., 2006
Comment MSDC-RI MSDC-RI

Normal alkane RI, non-polar column, temperature ramp

Data compiled by: NIST Mass Spectrometry Data Center, William E. Wallace, director

Column type CapillaryCapillaryCapillaryCapillaryCapillary
Active phase Optima-5HP-5 MSZB-5DB-5DB-1
Column length (m) 30.30.30.30.30.
Carrier gas HeliumHeliumHeliumHeHe
Substrate
Column diameter (mm) 0.250.250.250.250.25
Phase thickness (μm) 0.250.250.250.250.25
Tstart (C) 60.70.40.60.50.
Tend (C) 246.200.280.240.200.
Heat rate (K/min) 3.3.6.2.5.
Initial hold (min) 1.2.1.
Final hold (min)  18.9.
I 1402.1366.1415.1407.1370.
ReferenceAl-Qudah, Muhaidat, et al., 2012Jerkovic, Hegic, et al., 2010Harrison and Priest, 2009Cicció, 2004Kjällstrand, Ramnäs, et al., 1998
Comment MSDC-RI MSDC-RI MSDC-RI MSDC-RI MSDC-RI

References

Stephenson and Malanowski, 1987
Stephenson, Richard M.; Malanowski, Stanislaw,
Handbook of the Thermodynamics of Organic Compounds, 1987, https://doi.org/10.1007/978-94-009-3173-2
. [all data]