Cyclohexanol, 3-methyl-
- Formula: C7H14O
- Molecular weight: 114.1855
- IUPAC Standard InChIKey: HTSABYAWKQAHBT-UHFFFAOYSA-N
- CAS Registry Number: 591-23-1
- Chemical structure:
View 3d structure (requires JavaScript / HTML 5) - Stereoisomers:
- Other names: 3-Methylcyclohexanol; m-Methylcyclohexanol; 3-Methylcyclohexanol,c&t; Cyclohexanol, m-methyl-; 3-methylcyclohexanol, mixed isomers

Condensed phase thermochemistry data

Data compiled by: Eugene S. Domalski and Elizabeth D. Hearing
Constant pressure heat capacity of liquid
Cp,liquid (J/mol*K) | Temperature (K) | Reference |
---|---|---|
201.7 | 290. | Herz and Bloch, 1924 |

Phase change data

Data compiled as indicated in comments:
BS - Robert L. Brown and Stephen E. Stein
TRC - Thermodynamics Research Center, NIST Boulder Laboratories, Chris Muzny director
AC - William E. Acree, Jr., James S. Chickos
Quantity | Value | Units | Method | Reference | Comment |
---|---|---|---|---|---|
Tboil | 436.2 | K | N/A | Aldrich Chemical Company Inc., 1990 | BS |
Tboil | 444.35 | K | N/A | Lecat, 1930 | Uncertainty assigned by TRC = 0.5 K; not clear that this is a new measurement; TRC |
Quantity | Value | Units | Method | Reference | Comment |
ΔvapH° | 65.5 | kJ/mol | CGC | Chickos, Hosseini, et al., 1995 | Based on data from 323. to 373. K.; AC |

Van Den Dool and Kratz RI, non-polar column, temperature ramp

Column type | Active phase | I | Reference | Comment |
---|---|---|---|---|
Packed | SE-30 | 943. | Buchman, Cao, et al., 1984 | He, Chromosorb AW, 40. C @ 10. min, 10. K/min, 210. C @ 30. min; Column length: 3.05 m |
Packed | SE-30 | 947. | Buchman, Cao, et al., 1984 | He, Chromosorb AW, 40. C @ 10. min, 10. K/min, 210. C @ 30. min; Column length: 3.05 m |

Van Den Dool and Kratz RI, non-polar column, custom temperature program

Column type | Active phase | I | Reference | Comment |
---|---|---|---|---|
Packed | SE-30 | 950. | Peng, Ding, et al., 1988 | Supelcoport; Chromosorb; Column length: 3.05 m; Program: 40C(5min) => 10C/min => 200C or 250C (60min) |

Van Den Dool and Kratz RI, polar column, temperature ramp

Column type | Active phase | I | Reference | Comment |
---|---|---|---|---|
Packed | Carbowax 20M | 1463. | Buchman, Cao, et al., 1984 | He, Supelcoport, 40. C @ 10. min, 10. K/min, 210. C @ 30. min; Column length: 3.05 m |
Packed | Carbowax 20M | 1463. | Buchman, Cao, et al., 1984 | He, Supelcoport, 40. C @ 10. min, 10. K/min, 210. C @ 30. min; Column length: 3.05 m |

Normal alkane RI, non-polar column, temperature ramp

Column type | Active phase | I | Reference | Comment |
---|---|---|---|---|
Packed | SE-30 | 947. | Peng, Ding, et al., 1988, 2 | Helium, Supelcoport, 40. C @ 4. min, 10. K/min, 200. C @ 60. min; Column length: 3.05 m |
Packed | SE-30 | 950. | Peng, Ding, et al., 1988, 2 | Helium, Supelcoport, 40. C @ 4. min, 10. K/min, 200. C @ 60. min; Column length: 3.05 m |

Normal alkane RI, non-polar column, custom temperature program

Column type | Active phase | I | Reference | Comment |
---|---|---|---|---|
Capillary | OV-1, SE-30, Methyl silicone, SP-2100, OV-101, DB-1, etc. | 947. | Waggott and Davies, 1984 | Hydrogen; Column length: 50. m; Column diameter: 0.32 mm; Program: not specified |

References

Herz and Bloch, 1924
Herz, W.; Bloch, W.,
Physikalisch-chemische Untersuchungen an Verbindungen der Cyklohexanreihe,
Z. Phys. Chem., 1924, 110, 23-39. [all data]
Aldrich Chemical Company Inc., 1990
Aldrich Chemical Company Inc.,
Catalog Handbook of Fine Chemicals, Aldrich Chemical Company, Inc., Milwaukee WI, 1990, 1. [all data]
Lecat, 1930
Lecat, M.,
Azeotropism in Binary Mixtures Containing an Alcohol Mixed with an amine, a nitro derivative, an ether or water.,
Z. Anorg. Allg. Chem., 1930, 186, 119. [all data]
Chickos, Hosseini, et al., 1995
Chickos, James S.; Hosseini, Sarah; Hesse, Donald G.,
Determination of vaporization enthalpies of simple organic molecules by correlations of changes in gas chromatographic net retention times,
Thermochimica Acta, 1995, 249, 41-62, https://doi.org/10.1016/0040-6031(95)90670-3
. [all data]
Buchman, Cao, et al., 1984
Buchman, O.; Cao, G.-Y.; Peng, C.T.,
Structure assignment by retention index in gas-liquid radiochromatography of substituted cyclohexenes,
J. Chromatogr., 1984, 312, 75-90, https://doi.org/10.1016/S0021-9673(01)92765-7
. [all data]
Peng, Ding, et al., 1988
Peng, C.T.; Ding, S.F.; Hua, R.L.; Yang, Z.C.,
Prediction of Retention Indexes I. Structure-Retention Index Relationship on Apolar Columns,
J. Chromatogr., 1988, 436, 137-172, https://doi.org/10.1016/S0021-9673(00)94575-8
. [all data]
Peng, Ding, et al., 1988, 2
Peng, C.T.; Ding, S.F.; Hua, R.L.,
Radioimpurity identification by retention index in tritium labeling,
J. Radioanal. Nucl. Chem., 1988, 123, 2, 411-420, https://doi.org/10.1007/BF02034907
. [all data]
Waggott and Davies, 1984
Waggott, A.; Davies, I.W.,
Identification of organic pollutants using linear temperature programmed retention indices (LTPRIs) - Part II, 1984, retrieved from http://dwi.defra.gov.uk/research/completed-research/reports/dwi0383.pdf. [all data]