Benzenamine, 3-bromo-
- Formula: C6H6BrN
- Molecular weight: 172.023
- IUPAC Standard InChIKey: DHYHYLGCQVVLOQ-UHFFFAOYSA-N
- CAS Registry Number: 591-19-5
- Chemical structure:
View 3d structure (requires JavaScript / HTML 5) - Other names: Aniline, m-bromo-; m-Aminobromobenzene; m-Bromoaniline; 3-Bromoaniline; Aniline, 3-bromo-; 3-BrC6H4NH2

Phase change data

Data compiled as indicated in comments:
BS - Robert L. Brown and Stephen E. Stein
AC - William E. Acree, Jr., James S. Chickos
Quantity | Value | Units | Method | Reference | Comment |
---|---|---|---|---|---|
Tboil | 524.2 | K | N/A | Weast and Grasselli, 1989 | BS |
Tboil | 524. | K | N/A | Buckingham and Donaghy, 1982 | BS |
Quantity | Value | Units | Method | Reference | Comment |
Tfus | 291.6 | K | N/A | Buckingham and Donaghy, 1982 | BS |
Tfus | 289.8 | K | N/A | Buckingham and Donaghy, 1982 | BS |
Quantity | Value | Units | Method | Reference | Comment |
ΔvapH° | 63.4 ± 1.5 | kJ/mol | C | Ribeiro da Silva, Ferreira, et al., 2006 | AC |
Reduced pressure boiling point
Tboil (K) | Pressure (bar) | Reference | Comment |
---|---|---|---|
403.2 | 0.016 | Weast and Grasselli, 1989 | BS |
403. | 0.016 | Buckingham and Donaghy, 1982 | BS |
Enthalpy of fusion
ΔfusH (kJ/mol) | Temperature (K) | Reference | Comment |
---|---|---|---|
14.68 | 291. | Khanna, Khetarpal, et al., 1983 | AC |

Gas phase ion energetics data

Data evaluated by: Edward P. Hunter and Sharon G. Lias
Quantity | Value | Units | Method | Reference | Comment |
---|---|---|---|---|---|
Proton affinity (review) | 873.2 | kJ/mol | N/A | Hunter and Lias, 1998 | |
Quantity | Value | Units | Method | Reference | Comment |
Gas basicity | 841.4 | kJ/mol | N/A | Hunter and Lias, 1998 |

References

Weast and Grasselli, 1989
CRC Handbook of Data on Organic Compounds, 2nd Editon, Weast,R.C and Grasselli, J.G., ed(s)., CRC Press, Inc., Boca Raton, FL, 1989, 1. [all data]
Buckingham and Donaghy, 1982
Buckingham, J.; Donaghy, S.M.,
Dictionary of Organic Compounds: Fifth Edition, Chapman and Hall, New York, 1982, 1. [all data]
Ribeiro da Silva, Ferreira, et al., 2006
Ribeiro da Silva, Manuel A.V.; Ferreira, Ana I.M.C.L.; Gomes, José R.B.,
Experimental and Computational Study on the Thermochemistry of Bromoanilines,
Bull. Chem. Soc. Jpn., 2006, 79, 12, 1852-1859, https://doi.org/10.1246/bcsj.79.1852
. [all data]
Khanna, Khetarpal, et al., 1983
Khanna, M.S.; Khetarpal, S.C.; Lal, K.; Bhatnagar, H.L.,
Thermodynamic studies on melting of some o-, m-, and p-halogen derivatives of aniline,
Indian J. Pure Appl. Phys., 1983, 20, 6, 503. [all data]
Hunter and Lias, 1998
Hunter, E.P.; Lias, S.G.,
Evaluated Gas Phase Basicities and Proton Affinities of Molecules: An Update,
J. Phys. Chem. Ref. Data, 1998, 27, 3, 413-656, https://doi.org/10.1063/1.556018
. [all data]