Benzene, 1-bromo-3-methyl-

Phase change data

Data compiled as indicated in comments:
BS - Robert L. Brown and Stephen E. Stein
TRC - Thermodynamics Research Center, NIST Boulder Laboratories, Chris Muzny director
AC - William E. Acree, Jr., James S. Chickos

Quantity Value Units Method Reference Comment
Tboil456.9KN/AWeast and Grasselli, 1989BS
Tboil457.45KN/ALecat, 1943Uncertainty assigned by TRC = 0.4 K; TRC
Tboil457.16KN/AStuckey and Saylor, 1940Uncertainty assigned by TRC = 0.25 K; TRC
Quantity Value Units Method Reference Comment
Tfus235.01KN/AClements, Wise, et al., 1953Uncertainty assigned by TRC = 0.06 K; TRC
Tfus234.75KN/AHussey and Dyer, 1951Uncertainty assigned by TRC = 1. K; TRC

Enthalpy of vaporization

ΔvapH (kJ/mol) Temperature (K) Method Reference Comment
47.7366.N/ADykyj, Svoboda, et al., 1999Based on data from 351. - 457. K.; AC
48.3302.AStephenson and Malanowski, 1987Based on data from 287. - 457. K. See also Stull, 1947.; AC
49.4288.N/AStuckey and Saylor, 1940, 2Based on data from 273. - 348. K.; AC

Antoine Equation Parameters

log10(P) = A − (B / (T + C))
    P = vapor pressure (bar)
    T = temperature (K)

View plot Requires a JavaScript / HTML 5 canvas capable browser.

Temperature (K) A B C Reference Comment
287.9 - 456.96.513773506.40682.744Stull, 1947Coefficents calculated by NIST from author's data.

In addition to the Thermodynamics Research Center (TRC) data available from this site, much more physical and chemical property data is available from the following TRC products:

Reaction thermochemistry data

Data compiled by: John E. Bartmess

Individual Reactions

C7H6Br- + Hydrogen cation = Benzene, 1-bromo-3-methyl-

By formula: C7H6Br- + H+ = C7H7Br

Quantity Value Units Method Reference Comment
Δr373.6 ± 3.1kcal/molG+TSWenthold, Wierschke, et al., 1994gas phase; Between MeOCH2CH2OH and tBuCH2OH, near CH2Cl2
Quantity Value Units Method Reference Comment
Δr366.5 ± 3.0kcal/molIMRBWenthold, Wierschke, et al., 1994gas phase; Between MeOCH2CH2OH and tBuCH2OH, near CH2Cl2

Gas phase ion energetics data

Data evaluated as indicated in comments:
HL - Edward P. Hunter and Sharon G. Lias

Data compiled as indicated in comments:
B - John E. Bartmess
LLK - Sharon G. Lias, Rhoda D. Levin, and Sherif A. Kafafi
RDSH - Henry M. Rosenstock, Keith Draxl, Bruce W. Steiner, and John T. Herron
LL - Sharon G. Lias and Joel F. Liebman

Quantity Value Units Method Reference Comment
Proton affinity (review)186.9kcal/molN/AHunter and Lias, 1998HL
Quantity Value Units Method Reference Comment
Gas basicity179.9kcal/molN/AHunter and Lias, 1998HL

Ionization energy determinations

IE (eV) Method Reference Comment
8.77PEJohnstone and Mellon, 1973LLK
8.6 ± 0.1EITajima and Tsuchiya, 1972LLK
8.81 ± 0.02PIWatanabe, Nakayama, et al., 1962RDSH

Appearance energy determinations

Ion AE (eV) Other Products MethodReferenceComment
C5H5+15.2 ± 0.2C2H2+BrEITajima and Tsuchiya, 1973LLK
C5H5+15.20 ± 0.15C2H2+BrEITajima and Tsuchiya, 1972LLK
C7H7+≤10.99BrPIDunbar, Honovich, et al., 1988LL
C7H7+11.2 ± 0.1?EITajima and Tsuchiya, 1972LLK
C7H7+11.3BrEIYeo and Williams, 1970RDSH

De-protonation reactions

C7H6Br- + Hydrogen cation = Benzene, 1-bromo-3-methyl-

By formula: C7H6Br- + H+ = C7H7Br

Quantity Value Units Method Reference Comment
Δr373.6 ± 3.1kcal/molG+TSWenthold, Wierschke, et al., 1994gas phase; Between MeOCH2CH2OH and tBuCH2OH, near CH2Cl2; B
Quantity Value Units Method Reference Comment
Δr366.5 ± 3.0kcal/molIMRBWenthold, Wierschke, et al., 1994gas phase; Between MeOCH2CH2OH and tBuCH2OH, near CH2Cl2; B

References

Weast and Grasselli, 1989
CRC Handbook of Data on Organic Compounds, 2nd Editon, Weast,R.C and Grasselli, J.G., ed(s)., CRC Press, Inc., Boca Raton, FL, 1989, 1. [all data]

Lecat, 1943
Lecat, M., Azeotropes of Ethyl Urethane and other Azeotropes, C. R. Hebd. Seances Acad. Sci., 1943, 217, 273. [all data]

Stuckey and Saylor, 1940
Stuckey, J.M.; Saylor, J.H., Vapor Pressures of Organic Compounds I., J. Am. Chem. Soc., 1940, 62, 2922. [all data]

Clements, Wise, et al., 1953
Clements, H.E.; Wise, K.V.; Johnson, S.E.J., Physical Properties of o-, m-, and p-Methylstyrene, J. Am. Chem. Soc., 1953, 75, 1593. [all data]

Hussey and Dyer, 1951
Hussey, A.S.; Dyer, J.R., The Monomagnesium Derivatives of Dibromotoluenes, J. Am. Chem. Soc., 1951, 73, 603. [all data]

Dykyj, Svoboda, et al., 1999
Dykyj, J.; Svoboda, J.; Wilhoit, R.C.; Frenkel, M.L.; Hall, K.R., Vapor Pressure of Chemicals: Part A. Vapor Pressure and Antoine Constants for Hydrocarbons and Sulfur, Selenium, Tellurium and Hydrogen Containing Organic Compounds, Springer, Berlin, 1999, 373. [all data]

Stephenson and Malanowski, 1987
Stephenson, Richard M.; Malanowski, Stanislaw, Handbook of the Thermodynamics of Organic Compounds, 1987, https://doi.org/10.1007/978-94-009-3173-2 . [all data]

Stull, 1947
Stull, Daniel R., Vapor Pressure of Pure Substances. Organic and Inorganic Compounds, Ind. Eng. Chem., 1947, 39, 4, 517-540, https://doi.org/10.1021/ie50448a022 . [all data]

Stuckey and Saylor, 1940, 2
Stuckey, James M.; Saylor, John H., The Vapor Pressures of Some Organic Compounds. I. 1, J. Am. Chem. Soc., 1940, 62, 11, 2922-2925, https://doi.org/10.1021/ja01868a011 . [all data]