(Chloromethyl)cyclopropane
- Formula: C4H7Cl
- Molecular weight: 90.551
- IUPAC Standard InChIKey: ZVTQWXCKQTUVPY-UHFFFAOYSA-N
- CAS Registry Number: 5911-08-0
- Chemical structure:
View 3d structure (requires JavaScript / HTML 5) - Other names: Cyclopropylmethyl chloride; Cyclopropane, (chloromethyl)-

Phase change data

Data compiled by: Robert L. Brown and Stephen E. Stein
Quantity | Value | Units | Method | Reference | Comment |
---|---|---|---|---|---|
Tboil | 361.2 | K | N/A | Weast and Grasselli, 1989 | |
Tboil | 360. to 362. | K | N/A | Frinton Laboratories Inc., 1986 |

References

Weast and Grasselli, 1989
CRC Handbook of Data on Organic Compounds, 2nd Editon, Weast,R.C and Grasselli, J.G., ed(s)., CRC Press, Inc., Boca Raton, FL, 1989, 1. [all data]
Frinton Laboratories Inc., 1986
Frinton Laboratories Inc.,
Catalog Number 11, Frinton Laboratories Inc., Vineland, NJ, 1986, 99. [all data]