Pyrazine, 2,3-dimethyl-
- Formula: C6H8N2
- Molecular weight: 108.1411
- IUPAC Standard InChIKey: OXQOBQJCDNLAPO-UHFFFAOYSA-N
- CAS Registry Number: 5910-89-4
- Chemical structure:
View 3d structure (requires JavaScript / HTML 5) - Other names: 2,3-Dimethylpyrazine

Gas phase thermochemistry data

Data compiled by: Hussein Y. Afeefy, Joel F. Liebman, and Stephen E. Stein
Quantity | Value | Units | Method | Reference | Comment |
---|---|---|---|---|---|
ΔfH°gas | 30.11 | kcal/mol | Ccb | Ribeiro da Silva, Morais, et al., 1996 |

Condensed phase thermochemistry data

Data compiled by: Hussein Y. Afeefy, Joel F. Liebman, and Stephen E. Stein
Quantity | Value | Units | Method | Reference | Comment |
---|---|---|---|---|---|
ΔfH°liquid | 17.5 ± 0.48 | kcal/mol | Ccb | Ribeiro da Silva, Morais, et al., 1996 | |
Quantity | Value | Units | Method | Reference | Comment |
ΔcH°liquid | -855.11 ± 0.41 | kcal/mol | Ccb | Ribeiro da Silva, Morais, et al., 1996 |

Phase change data

Data compiled as indicated in comments:
BS - Robert L. Brown and Stephen E. Stein
AC - William E. Acree, Jr., James S. Chickos
ALS - Hussein Y. Afeefy, Joel F. Liebman, and Stephen E. Stein
DRB - Donald R. Burgess, Jr.
Quantity | Value | Units | Method | Reference | Comment |
---|---|---|---|---|---|
Tboil | 429.2 | K | N/A | Weast and Grasselli, 1989 | BS |
Quantity | Value | Units | Method | Reference | Comment |
ΔvapH° | 12.6 ± 0.41 | kcal/mol | C | Morais, Miranda, et al., 2003 | AC |
ΔvapH° | 12.6 | kcal/mol | E | Ribeiro da Silva, Morais, et al., 1996 | ALS |
ΔvapH° | 12.6 | kcal/mol | N/A | Ribeiro da Silva, Morais, et al., 1996 | DRB |

Van Den Dool and Kratz RI, non-polar column, temperature ramp

Data compiled by: NIST Mass Spectrometry Data Center, William E. Wallace, director

Column type CapillaryCapillaryCapillaryCapillaryCapillary
Active phase CP Sil 8 CBBPX-5BPX-5BPX-5BPX-5
Column length (m) 50.50.50.50.50.
Carrier gas   HeHeHe
Substrate
Column diameter (mm) 0.320.320.320.320.32
Phase thickness (μm)  0.50.50.250.25
Tstart (C) 60.60.60.60.60.
Tend (C) 220.250.250.250.250.
Heat rate (K/min) 4.4.4.4.4.
Initial hold (min) 5.5.5.5.5.
Final hold (min) 30.20.10.10.10.
I 897.939.931.932.940.
ReferenceMahadevan and Farmer, 2006Bredie, Mottram, et al., 2002Ames, Guy, et al., 2001Ames, Guy, et al., 2001, 2Ames, Guy, et al., 2001, 2
Comment MSDC-RI MSDC-RI MSDC-RI MSDC-RI MSDC-RI
Column type CapillaryCapillaryCapillaryCapillaryCapillary
Active phase DB-1BP-5DB-5DB-1BPX-5
Column length (m) 60.50.30.60.50.
Carrier gas He H2N2He
Substrate
Column diameter (mm) 0.320.320.320.250.325
Phase thickness (μm) 1. 1.1.0.5
Tstart (C) 40.60.40.30.20.
Tend (C) 220.250.210.200.250.
Heat rate (K/min) 2.4.3.5.4.
Initial hold (min) 5.   2.
Final hold (min)    30.10.
I 892.919.927.899.929.
ReferenceKim, 2001Whitfield and Mottram, 2001Moio, Piombino, et al., 2000Wu, Wang, et al., 2000Hill, Isaacs, et al., 1999
Comment MSDC-RI MSDC-RI MSDC-RI MSDC-RI MSDC-RI
Column type CapillaryCapillaryCapillaryCapillaryCapillary
Active phase BPX-5DB-5DB-5BPX-5DB-1
Column length (m) 50.30.30.50.30.
Carrier gas HeH2H2HeHe
Substrate
Column diameter (mm) 0.3250.320.320.3250.248
Phase thickness (μm) 0.51.1.0.50.25
Tstart (C) 20.40.40.50.50.
Tend (C) 250.210.210.250.250.
Heat rate (K/min) 4.3.3.4.5.
Initial hold (min) 2.  2.5.
Final hold (min) 10.  10.
I 930.927.927.932.889.
ReferenceHill, Isaacs, et al., 1999Moio and Addeo, 1998Moio and Addeo, 1998Ames, Defaye, et al., 1997DeMilo, Lee, et al., 1996
Comment MSDC-RI MSDC-RI MSDC-RI MSDC-RI MSDC-RI
Column type CapillaryCapillaryCapillaryCapillaryCapillary
Active phase DB-1DB-1SPB-1HP-1HP-1
Column length (m) 30.30.30.50.50.
Carrier gas HeHeHeHe
Substrate
Column diameter (mm) 0.2480.2480.250.320.32
Phase thickness (μm) 0.250.250.251.051.5
Tstart (C) 50.50.50.40.40.
Tend (C) 250.250.250.260.220.
Heat rate (K/min) 5.5.5.2.2.
Initial hold (min) 5.5.5.
Final hold (min)    10.30.
I 891.891.892.900.897.
ReferenceDeMilo, Lee, et al., 1996DeMilo, Lee, et al., 1996Lee, DeMilo, et al., 1995Oh, Hartman, et al., 1992Zhang, Dorjpalam, et al., 1992
Comment MSDC-RI MSDC-RI MSDC-RI MSDC-RI MSDC-RI
Column type CapillaryCapillaryCapillaryCapillaryCapillary
Active phase OV-101OV-101OV-101DB-1SE-30
Column length (m) 50.50.50.50.50.
Carrier gas HeHeHeHe
Substrate
Column diameter (mm) 0.250.250.250.320.32
Phase thickness (μm)    1.050.25
Tstart (C) 100.70.80.40.50.
Tend (C)    260.240.
Heat rate (K/min) 2.8.4.2.4.
Initial hold (min)
Final hold (min)    40.
I 900.898.897.2891.896.
ReferenceGolovnya, Samusenko, et al., 1991Golovnya, Samusenko, et al., 1991Golovnya, Samusenko, et al., 1991Izzo and Ho, 1991Misharina, Golovnya, et al., 1991
Comment MSDC-RI MSDC-RI MSDC-RI MSDC-RI MSDC-RI
Column type Capillary
Active phase DB-1
Column length (m) 60.
Carrier gas He
Substrate
Column diameter (mm) 0.25
Phase thickness (μm) 0.25
Tstart (C) 40.
Tend (C) 220.
Heat rate (K/min) 2.
Initial hold (min)
Final hold (min) 10.
I 896.
ReferenceZhang and Ho, 1991
Comment MSDC-RI

References

Ribeiro da Silva, Morais, et al., 1996
Ribeiro da Silva, M.A.V.; Morais, V.M.F.; Matos, M.A.R.; Rio, C.M.A.; Piedade, G.M.G.S.,
Thermochemical and theoretical study of some methyldiazines,
Struct. Chem., 1996, 7, 329-336. [all data]
Weast and Grasselli, 1989
CRC Handbook of Data on Organic Compounds, 2nd Editon, Weast,R.C and Grasselli, J.G., ed(s)., CRC Press, Inc., Boca Raton, FL, 1989, 1. [all data]
Morais, Miranda, et al., 2003
Morais, Victor M.F.; Miranda, Margarida S.; Matos, M. Agostinha R.,
Thermochemical study of the ethylpyridine and ethylpyrazine isomers,
Org. Biomol. Chem., 2003, 1, 23, 4329-712, https://doi.org/10.1039/b308097h
. [all data]