1,4-Dihydroanthracene
- Formula: C14H12
- Molecular weight: 180.2451
- IUPAC Standard InChIKey: FTDLXZYXJAJLIP-UHFFFAOYSA-N
- CAS Registry Number: 5910-32-7
- Chemical structure:
View 3d structure (requires JavaScript / HTML 5) - Permanent link for this species. Use this link for bookmarking this species for future reference.

Gas phase thermochemistry data

Data compiled by: Glushko Thermocenter, Russian Academy of Sciences, Moscow
Constant pressure heat capacity of gas
Cp,gas (J/mol*K) | Temperature (K) | Reference | Comment |
---|---|---|---|
46.93 | 50. | Dorofeeva O.V., 1988 | Recommended values were calculated statistically mechanically using force field approximation for polycyclic aromatic hydrocarbons to estimate the needed vibrational frequencies (see also [ Dorofeeva O.V., 1986]). These functions are reproduced in the reference book [ Frenkel M., 1994]. |
68.75 | 100. | ||
95.36 | 150. | ||
125.91 | 200. | ||
175.53 | 273.15 | ||
193.0 ± 2.5 | 298.15 | ||
194.26 | 300. | ||
261.04 | 400. | ||
318.08 | 500. | ||
364.48 | 600. | ||
402.07 | 700. | ||
432.85 | 800. | ||
458.36 | 900. | ||
479.71 | 1000. | ||
497.71 | 1100. | ||
512.98 | 1200. | ||
526.00 | 1300. | ||
537.16 | 1400. | ||
546.77 | 1500. |

References

Dorofeeva O.V., 1988
Dorofeeva O.V.,
Thermodynamic Properties of Polycyclic Aromatic Hydrocarbons in the Gaseous Phase. Institute for High Temperatures, USSR Academy of Sciences, Preprint No.1-238 (in Russian), Moscow, 1988. [all data]
Dorofeeva O.V., 1986
Dorofeeva O.V.,
On calculation of thermodynamic properties of polycyclic aromatic hydrocarbons,
Thermochim. Acta, 1986, 102, 59-66. [all data]
Frenkel M., 1994
Frenkel M.,
Thermodynamics of Organic Compounds in the Gas State, Vol. I, II, Thermodynamics Research Center, College Station, Texas, 1994, 1994. [all data]