N-methyl-2,6-dinitroaniline
- Formula: C7H7N3O4
- Molecular weight: 197.1482
- IUPAC Standard InChIKey: YEYQXUWULBDKHV-UHFFFAOYSA-N
- CAS Registry Number: 5910-19-0
- Chemical structure:
View 3d structure (requires JavaScript / HTML 5) - Permanent link for this species. Use this link for bookmarking this species for future reference.

Condensed phase thermochemistry data

Data compiled by: Hussein Y. Afeefy, Joel F. Liebman, and Stephen E. Stein
Quantity | Value | Units | Method | Reference | Comment |
---|---|---|---|---|---|
ΔfH°solid | -14.0 ± 1.9 | kJ/mol | Ccb | Medard and Thomas, 1957 | Reanalyzed by Cox and Pilcher, 1970, Original value = -10.3 kJ/mol |
Quantity | Value | Units | Method | Reference | Comment |
ΔcH°solid | -3741.0 ± 1.9 | kJ/mol | Ccb | Medard and Thomas, 1957 | Reanalyzed by Cox and Pilcher, 1970, Original value = -3746.1 kJ/mol |

References

Medard and Thomas, 1957
Medard, L.; Thomas, M.,
Chaleur de combustion de onze substances explosives ou apparentees a des explosifs,
Mem. Poudres, 1957, 39, 195-208. [all data]
Cox and Pilcher, 1970
Cox, J.D.; Pilcher, G.,
Thermochemistry of Organic and Organometallic Compounds, Academic Press, New York, 1970, 1-636. [all data]