Docosanoic acid, ethyl ester
- Formula: C24H48O2
- Molecular weight: 368.6367
- IUPAC Standard InChIKey: JIZCYLOUIAIZHQ-UHFFFAOYSA-N
- CAS Registry Number: 5908-87-2
- Chemical structure:
View 3d structure (requires JavaScript / HTML 5) - Other names: Ethyl docosanoate; Ethyl behenoate

Phase change data

Data compiled as indicated in comments:
BS - Robert L. Brown and Stephen E. Stein
AC - William E. Acree, Jr., James S. Chickos
DH - Eugene S. Domalski and Elizabeth D. Hearing
Reduced pressure boiling point
Tboil (K) | Pressure (bar) | Reference | Comment |
---|---|---|---|
514.2 | 0.013 | Weast and Grasselli, 1989 | BS |
Enthalpy of vaporization
ΔvapH (kJ/mol) | Temperature (K) | Method | Reference | Comment |
---|---|---|---|---|
127.5 | 335. | A,ME | Stephenson and Malanowski, 1987 | Based on data from 327. to 344. K. See also Berman and West, 1967.; AC |
Enthalpy of sublimation
ΔsubH (kJ/mol) | Temperature (K) | Method | Reference | Comment |
---|---|---|---|---|
196.5 | 315.5 | ME | Stephenson and Malanowski, 1987 | Based on data from 313. to 318. K. See also Omar, 1967.; AC |
Enthalpy of fusion
ΔfusH (kJ/mol) | Temperature (K) | Reference | Comment |
---|---|---|---|
19.16 | 321. | Domalski and Hearing, 1996 | AC |
77.82 | 321. | Omar, 1967 | AC |
Enthalpy of phase transition
ΔHtrs (kJ/mol) | Temperature (K) | Initial Phase | Final Phase | Reference | Comment |
---|---|---|---|---|---|
9.578 | 312.15 | crystaline, II, á | crystaline, I, à transition | King and Garner, 1934 | DH |
19.157 | 320.95 | crystaline, I, à | liquid, liq transition | King and Garner, 1934 | DH |

Condensed phase thermochemistry data

Data compiled by: Hussein Y. Afeefy, Joel F. Liebman, and Stephen E. Stein

Quantity Value Units Method Reference Comment
Δcsolid-15196. ± 1.kJ/molCcbFreedman, Bagby, et al., 1989Corresponding Δfsolid = -1108. kJ/mol (simple calculation by NIST; no Washburn corrections)

References

Weast and Grasselli, 1989
CRC Handbook of Data on Organic Compounds, 2nd Editon, Weast,R.C and Grasselli, J.G., ed(s)., CRC Press, Inc., Boca Raton, FL, 1989, 1. [all data]
Stephenson and Malanowski, 1987
Stephenson, Richard M.; Malanowski, Stanislaw,
Handbook of the Thermodynamics of Organic Compounds, 1987, https://doi.org/10.1007/978-94-009-3173-2
. [all data]
Berman and West, 1967
Berman, Horace A.; West, Estal Dale,
Density and vapor pressure of nitromethane 26.degree. to 200.degree.,
J. Chem. Eng. Data, 1967, 12, 2, 197-199, https://doi.org/10.1021/je60033a011
. [all data]
Omar, 1967
Omar, M.M.,
Vapour pressures, heats of sublimation, and heats of vaporisation for straight-chain ethyl esters,
J. Chem. Soc., C, 1967, 2038, https://doi.org/10.1039/j39670002038
. [all data]
Domalski and Hearing, 1996
Domalski, Eugene S.; Hearing, Elizabeth D.,
Heat Capacities and Entropies of Organic Compounds in the Condensed Phase. Volume III,
J. Phys. Chem. Ref. Data, 1996, 25, 1, 1, https://doi.org/10.1063/1.555985
. [all data]
King and Garner, 1934
King, A.M.; Garner, W.E.,
The heats of crystallisation of the ethyl esters of the monobasic aliphatic acids, 1934, J. [all data]