Disulfide, methyl 1-propenyl

Kovats' RI, non-polar column, isothermal

View large format table.

Column type Active phase Temperature (C) I Reference Comment
CapillaryOV-101130.936.Misharina and Golovnya, 1989He; Column length: 50. m; Column diameter: 0.32 mm

Van Den Dool and Kratz RI, non-polar column, temperature ramp

View large format table.

Column type Active phase I Reference Comment
CapillaryOV-101921.Misharina and Golovnya, 1989He, 4. K/min; Column length: 50. m; Column diameter: 0.32 mm; Tstart: 50. C; Tend: 250. C
CapillaryOV-1921.Schreyen, Dirinck, et al., 19761. K/min; Column length: 183. m; Column diameter: 0.762 mm; Tstart: 0. C; Tend: 230. C

Van Den Dool and Kratz RI, polar column, temperature ramp

View large format table.

Column type Active phase I Reference Comment
CapillaryFFAP1269.Calvo-Gómez, Morales-López, et al., 200430. m/0.25 mm/0.25 μm, He, 40. C @ 3. min, 5. K/min; Tend: 220. C
CapillaryDB-Wax1263.Nielsen, Larsen, et al., 200430. m/0.25 mm/0.25 μm, He, 45. C @ 10. min, 6. K/min, 240. C @ 30. min
CapillaryDB-Wax1292.Nielsen, Larsen, et al., 200430. m/0.25 mm/0.25 μm, He, 45. C @ 10. min, 6. K/min, 240. C @ 30. min
CapillaryDB-Wax1250.Nielsen and Poll, 200430. m/0.25 mm/0.25 μm, He, 45. C @ 10. min, 3. K/min, 240. C @ 30. min
CapillaryDB-Wax1274.Nielsen and Poll, 200430. m/0.25 mm/0.25 μm, He, 45. C @ 10. min, 3. K/min, 240. C @ 30. min
CapillaryCarbowax1270.Edris and Fadel, 2002He, 2. K/min; Column length: 60. m; Column diameter: 0.32 mm; Tstart: 50. C; Tend: 200. C
CapillaryCP-Wax 52CB1225.Yu, Wu, et al., 199350. m/0.32 mm/0.25 μm, H2, 40. C @ 10. min, 1.5 K/min, 200. C @ 60. min

Normal alkane RI, non-polar column, temperature ramp

View large format table.

Column type Active phase I Reference Comment
CapillaryDB-1902.Hanum, Sinha, et al., 199530. m/0.25 mm/0.25 μm, He, 5. K/min; Tstart: 35. C; Tend: 150. C
CapillaryDB-1910.Hanum, Sinha, et al., 199530. m/0.25 mm/0.25 μm, He, 5. K/min; Tstart: 35. C; Tend: 150. C
CapillaryDB-5922.Sinha, Guyer, et al., 1992He, 2. K/min; Column length: 30. m; Column diameter: 0.2 mm; Tstart: 30. C; Tend: 200. C

Normal alkane RI, non-polar column, custom temperature program

View large format table.

Column type Active phase I Reference Comment
CapillaryVF-5922.Shivashankar, Roy, et al., 201230. m/0.25 mm/0.25 μm, Helium; Program: 50 0C (2 min) 3 0C/min -> 200 0C (3 min) 10 0C/min -> 220 0C (8 min)
CapillaryVF-5922.Shivashankar, Roy, et al., 201230. m/0.25 mm/0.25 μm, Helium; Program: not specified
CapillaryDB-5950.Mateo and Zumalacárregui, 199650. m/0.32 mm/0.25 μm, He; Program: 40C (10min) => 3C/min => 95C => 10C/min => 270C (10min)
CapillaryDB-5951.Mateo and Zumalacárregui, 199650. m/0.32 mm/0.25 μm, He; Program: 40C (10min) => 3C/min => 95C => 10C/min => 270C (10min)

References

Misharina and Golovnya, 1989
Misharina, T.A.; Golovnya, R.V., Regularities of retention of a pseudohomologous series of dialkylpolysulfides in capillary gas chromatography, Zh. Anal. Khim., 1989, 44, 514-519. [all data]

Schreyen, Dirinck, et al., 1976
Schreyen, L.; Dirinck, P.; van Wassenhove, F.; Schamp, N., Analysis of leek volatiles by headspace condensation, J. Agric. Food Chem., 1976, 24, 6, 1147-1152, https://doi.org/10.1021/jf60208a023 . [all data]

Calvo-Gómez, Morales-López, et al., 2004
Calvo-Gómez, O.; Morales-López, J.; López, M.G., Solid-phase microextraction-gas chromatographic-mass spectrometric analysis of garlic oil obtained by hydrodistillation, J. Chromatogr. A, 2004, 1036, 1, 91-93, https://doi.org/10.1016/j.chroma.2004.02.072 . [all data]

Nielsen, Larsen, et al., 2004
Nielsen, G.S.; Larsen, L.M.; Poll, L., Impact of blanching and packaging atmosphere on the formation of aroma compounds during long-term frozen storage of leek (Allium ampeloprasum Var. Bulga) slices, J. Agric. Food Chem., 2004, 52, 15, 4844-4852, https://doi.org/10.1021/jf049623c . [all data]

Nielsen and Poll, 2004
Nielsen, G.S.; Poll, L., Determination of odor active aroma compounds in freshly cut leek (Allium ampeloprasum Var. Bulga) and in long-term stored frozen unblanched and blanched leek slices by gas chromatography olfactometry analysis, J. Agric. Food Chem., 2004, 52, 6, 1642-1646, https://doi.org/10.1021/jf030682k . [all data]

Edris and Fadel, 2002
Edris, A.E.; Fadel, H.M., Investigation of the volatile aroma components of garlic leaves essential oil. Possibility of utilization to enrich garlic bulb oil, Eur. Food Res. Technol., 2002, 214, 2, 105-107, https://doi.org/10.1007/s00217-001-0429-2 . [all data]

Yu, Wu, et al., 1993
Yu, T.-H.; Wu, C.-M.; Ho, C.-T., Volatile compounds of deep-oil fried, microwave-heated, and oven-baked garlic slices, J. Agric. Food Chem., 1993, 41, 5, 800-805, https://doi.org/10.1021/jf00029a023 . [all data]

Hanum, Sinha, et al., 1995
Hanum, T.; Sinha, N.K.; Guyer, D.E.; Cash, J.N., Pyruvate and flavor development in macerated onions (Allium cepa L.) by γ-glutamyl transpeptidase and exogenous C-S lyase, Food Chem., 1995, 54, 2, 183-188, https://doi.org/10.1016/0308-8146(95)00027-G . [all data]

Sinha, Guyer, et al., 1992
Sinha, N.K.; Guyer, D.E.; Gage, D.A.; Lira, C.T., Supercritical carbon dioxide extraction of onion flavors and their analysis by gas chromatography-mass spectrometry, J. Agric. Food Chem., 1992, 40, 5, 842-845, https://doi.org/10.1021/jf00017a027 . [all data]

Shivashankar, Roy, et al., 2012
Shivashankar, S.; Roy, T.K.; Moorthy, P.N.R., Headspace solid phase micro extraction and GC/MS analysis of the volatile components in seed and cake of Azadirachta indica A. juss, Chem. Bull. of Politechnika Univ. Timisoara, Romania, 2012, 57(71), 1, 1-6. [all data]

Mateo and Zumalacárregui, 1996
Mateo, J.; Zumalacárregui, J.M., Volatile compounds in chorizo and their changes during ripening, Meat Sci., 1996, 44, 4, 255-273, https://doi.org/10.1016/S0309-1740(96)00028-9 . [all data]