2-Pentanone, 4,4-dimethyl-
- Formula: C7H14O
- Molecular weight: 114.1855
- IUPAC Standard InChIKey: AZASWMGVGQEVCS-UHFFFAOYSA-N
- CAS Registry Number: 590-50-1
- Chemical structure:
View 3d structure (requires JavaScript / HTML 5) - Other names: Methyl neopentyl ketone; Methyl neoamyl ketone; Neopentyl methyl ketone; 4,4-Dimethyl-2-pentanone; neo-C5H11COCH3; 4,4-dimethylpentan-2-one

Gas phase thermochemistry data

Data compiled by: Hussein Y. Afeefy, Joel F. Liebman, and Stephen E. Stein
Quantity | Value | Units | Method | Reference | Comment |
---|---|---|---|---|---|
ΔfH°gas | -320.5 ± 1.9 | kJ/mol | Ccb | Dubois and Herzog, 1972 |

Phase change data

Data compiled as indicated in comments:
BS - Robert L. Brown and Stephen E. Stein
TRC - Thermodynamics Research Center, NIST Boulder Laboratories, Chris Muzny director
Quantity | Value | Units | Method | Reference | Comment |
---|---|---|---|---|---|
Tboil | 398. ± 4. | K | AVG | N/A | Average of 24 values; Individual data points |

Reaction thermochemistry data

Data compiled by: Hussein Y. Afeefy, Joel F. Liebman, and Stephen E. Stein
Individual Reactions
By formula: C9H20O2 + H2O = C7H14O + 2CH4O
Quantity | Value | Units | Method | Reference | Comment |
---|---|---|---|---|---|
ΔrH° | 6.870 ± 0.088 | kJ/mol | Cm | Wiberg, 1980 | liquid phase; solvent: Water; Hydrolysis |
ΔrH° | 6.86 ± 0.08 | kJ/mol | Cm | Wiberg and Squires, 1979 | liquid phase; Heat of hydrolysis |

Kovats' RI, non-polar column, isothermal

Column type | Active phase | Temperature (C) | I | Reference | Comment |
---|---|---|---|---|---|
Packed | Apiezon L | 120. | 750. | Bogoslovsky, Anvaer, et al., 1978 | Celite 545 |
Packed | Apiezon L | 160. | 765. | Bogoslovsky, Anvaer, et al., 1978 | Celite 545 |

Normal alkane RI, polar column, custom temperature program

Column type | Active phase | I | Reference | Comment |
---|---|---|---|---|
Capillary | SOLGel-Wax | 1025. | Johanningsmeier and McFeeters, 2011 | 30. m/0.25 mm/0.25 μm, Helium; Program: 40 0C (2 min) 5 0C/min -> 140 0C 10 0C/min -> 250 0C (3 min) |

Gas phase ion energetics data

Data compiled as indicated in comments:
LLK - Sharon G. Lias, Rhoda D. Levin, and Sherif A. Kafafi
Ionization energy determinations
IE (eV) | Method | Reference | Comment |
---|---|---|---|
9.226 ± 0.005 | PE | Hernandez, Masclet, et al., 1977 | LLK |

References

Dubois and Herzog, 1972
Dubois, J.-E.; Herzog, H.,
Heats of formation of aliphatic ketones: Structure correlation based on environment treatment,
J. Chem. Soc. Chem. Commun., 1972, 932-933. [all data]
Wiberg, 1980
Wiberg, K.B.,
Energies of organic compounds,
Rept. DOE-E(11-1)4060 Prepared for US Dept. of Energy by Yale Univ., New Haven, CT. Avail. NTIS, 1980, 1-24. [all data]
Wiberg and Squires, 1979
Wiberg, K.B.; Squires, R.R.,
Thermodynamics of hydrolysis aliphatic ketals. An entropy component of steric effects,
J. Am. Chem. Soc., 1979, 101, 5512-5515. [all data]