2-Pentanol, 2-methyl-
- Formula: C6H14O
- Molecular weight: 102.1748
- IUPAC Standard InChIKey: WFRBDWRZVBPBDO-UHFFFAOYSA-N
- CAS Registry Number: 590-36-3
- Chemical structure:
View 3d structure (requires JavaScript / HTML 5) - Other names: 2-Hydroxy-2-methylpentane; 2-Methyl-2-pentanol; 2-Methylpentan-2-ol; UN 2560; 1,1-Dimethylbutanol; 2-Methyl-2-hydroxypentane; Methyl-2 pentanol-2

Condensed phase thermochemistry data

Data compiled by: Eugene S. Domalski and Elizabeth D. Hearing
Constant pressure heat capacity of liquid
Cp,liquid (J/mol*K) | Temperature (K) | Reference |
---|---|---|
289.03 | 298.15 | Ortega, 1986 |

Phase change data

Data compiled as indicated in comments:
BS - Robert L. Brown and Stephen E. Stein
TRC - Thermodynamics Research Center, NIST Boulder Laboratories, Chris Muzny director
AC - William E. Acree, Jr., James S. Chickos
Quantity | Value | Units | Method | Reference | Comment |
---|---|---|---|---|---|
Tboil | 395. ± 2. | K | AVG | N/A | Average of 19 values; Individual data points |
Quantity | Value | Units | Method | Reference | Comment |
Tc | 559.5 ± 0.7 | K | N/A | Gude and Teja, 1995 | |
Tc | 559.5 | K | N/A | Majer and Svoboda, 1985 | |
Tc | 559.5 | K | N/A | Lawrenson and Lee, 1978 | Uncertainty assigned by TRC = 0.7 K; Visual, decomp.; TRC |
Quantity | Value | Units | Method | Reference | Comment |
ΔvapH° | 54.82 | kJ/mol | N/A | Majer and Svoboda, 1985 | |
ΔvapH° | 54.7 ± 0.2 | kJ/mol | C | Majer, Svoboda, et al., 1985 | AC |
Enthalpy of vaporization
ΔvapH (kJ/mol) | Temperature (K) | Method | Reference | Comment |
---|---|---|---|---|
39.59 | 394.2 | N/A | Majer and Svoboda, 1985 | |
44.2 | 356. | A | Stephenson and Malanowski, 1987 | Based on data from 341. to 396. K.; AC |
48.9 | 345. | A | Stephenson and Malanowski, 1987 | Based on data from 330. to 397. K.; AC |
52.8 ± 0.2 | 313. | C | Majer, Svoboda, et al., 1985 | AC |
50.7 ± 0.2 | 328. | C | Majer, Svoboda, et al., 1985 | AC |
48.5 ± 0.2 | 343. | C | Majer, Svoboda, et al., 1985 | AC |
46.1 ± 0.2 | 358. | C | Majer, Svoboda, et al., 1985 | AC |
44.4 ± 0.2 | 368. | C | Majer, Svoboda, et al., 1985 | AC |
58.3 | 303. | N/A | Wilhoit and Zwolinski, 1973 | Based on data from 288. to 396. K.; AC |
49.1 | 283. | N/A | Stull, 1947 | Based on data from 268. to 394. K.; AC |
51.3 | 303. | I | Hovorka, Lankelma, et al., 1933 | Based on data from 288. to 396. K.; AC |
Enthalpy of vaporization
ΔvapH = A exp(-αTr)
(1 − Tr)β
ΔvapH =
Enthalpy of vaporization (at saturation pressure)
(kJ/mol)
Tr = reduced temperature (T / Tc)
View plot Requires a JavaScript / HTML 5 canvas capable browser.
Temperature (K) | 298. to 368. |
---|---|
A (kJ/mol) | 69.24 |
α | -1.23 |
β | 1.1694 |
Tc (K) | 559.5 |
Reference | Majer and Svoboda, 1985 |
Antoine Equation Parameters
log10(P) = A − (B / (T + C))
P = vapor pressure (bar)
T = temperature (K)
View plot Requires a JavaScript / HTML 5 canvas capable browser.
Temperature (K) | A | B | C | Reference | Comment |
---|---|---|---|---|---|
268.7 to 394.3 | 4.99834 | 1707.886 | -51.913 | Stull, 1947 | Coefficents calculated by NIST from author's data. |

Henry's Law data

Data compiled by: Rolf Sander
Henry's Law constant (water solution)
kH(T) = k°H exp(d(ln(kH))/d(1/T) ((1/T) - 1/(298.15 K)))
k°H = Henry's law constant for solubility in water at 298.15 K (mol/(kg*bar))
d(ln(kH))/d(1/T) = Temperature dependence constant (K)
k°H (mol/(kg*bar)) | d(ln(kH))/d(1/T) (K) | Method | Reference |
---|---|---|---|
31. | V | N/A |

Gas phase ion energetics data

Data compiled by: John E. Bartmess
De-protonation reactions
C6H13O- + =
By formula: C6H13O- + H+ = C6H14O
Quantity | Value | Units | Method | Reference | Comment |
---|---|---|---|---|---|
ΔrH° | 1558. ± 8.4 | kJ/mol | CIDC | Haas and Harrison, 1993 | gas phase; Both metastable and 50 eV collision energy. |
ΔrH° | 1557. ± 12. | kJ/mol | G+TS | Boand, Houriet, et al., 1983 | gas phase; value altered from reference due to change in acidity scale |
Quantity | Value | Units | Method | Reference | Comment |
ΔrG° | 1531. ± 8.8 | kJ/mol | H-TS | Haas and Harrison, 1993 | gas phase; Both metastable and 50 eV collision energy. |
ΔrG° | 1529. ± 11. | kJ/mol | CIDC | Boand, Houriet, et al., 1983 | gas phase; value altered from reference due to change in acidity scale |

Reaction thermochemistry data

Data compiled by: John E. Bartmess
Individual Reactions
C6H13O- + =
By formula: C6H13O- + H+ = C6H14O
Quantity | Value | Units | Method | Reference | Comment |
---|---|---|---|---|---|
ΔrH° | 372.4 ± 2.0 | kcal/mol | CIDC | Haas and Harrison, 1993 | gas phase; Both metastable and 50 eV collision energy. |
ΔrH° | 372.1 ± 2.8 | kcal/mol | G+TS | Boand, Houriet, et al., 1983 | gas phase; value altered from reference due to change in acidity scale |
Quantity | Value | Units | Method | Reference | Comment |
ΔrG° | 365.8 ± 2.1 | kcal/mol | H-TS | Haas and Harrison, 1993 | gas phase; Both metastable and 50 eV collision energy. |
ΔrG° | 365.5 ± 2.7 | kcal/mol | CIDC | Boand, Houriet, et al., 1983 | gas phase; value altered from reference due to change in acidity scale |

References

Ortega, 1986
Ortega, J.,
Excess molar heat capacities of the binary mixtures of cyclohexane with isomers of hexanol at 298.15 K,
Rev. Latinoam. Ing. Quim. Quim. Apl., 1986, 16, 307-315. [all data]
Gude and Teja, 1995
Gude, M.; Teja, A.S.,
Vapor-Liquid Critical Properties of Elements and Compounds. 4. Aliphatic Alkanols,
J. Chem. Eng. Data, 1995, 40, 1025-1036. [all data]
Majer and Svoboda, 1985
Majer, V.; Svoboda, V.,
Enthalpies of Vaporization of Organic Compounds: A Critical Review and Data Compilation, Blackwell Scientific Publications, Oxford, 1985, 300. [all data]
Lawrenson and Lee, 1978
Lawrenson, I.J.; Lee, D.A.,
Thermodynamic properties of organic oxygen compounds XLVIII. The critical temperature of some alkanols,
J. Chem. Thermodyn., 1978, 10, 1111. [all data]
Majer, Svoboda, et al., 1985
Majer, V.; Svoboda, V.; Lencka, M.,
Enthalpies of vaporization and cohesive energies of dimethylpyridines and trimethylpyridines,
The Journal of Chemical Thermodynamics, 1985, 17, 4, 365-370, https://doi.org/10.1016/0021-9614(85)90133-8
. [all data]
Stephenson and Malanowski, 1987
Stephenson, Richard M.; Malanowski, Stanislaw,
Handbook of the Thermodynamics of Organic Compounds, 1987, https://doi.org/10.1007/978-94-009-3173-2
. [all data]
Wilhoit and Zwolinski, 1973
Wilhoit, R.C.; Zwolinski, B.J.,
Physical and thermodynamic properties of aliphatic alcohols,
J. Phys. Chem. Ref. Data Suppl., 1973, 1, 2, 1. [all data]
Stull, 1947
Stull, Daniel R.,
Vapor Pressure of Pure Substances. Organic and Inorganic Compounds,
Ind. Eng. Chem., 1947, 39, 4, 517-540, https://doi.org/10.1021/ie50448a022
. [all data]
Hovorka, Lankelma, et al., 1933
Hovorka, Frank; Lankelma, H.P.; Naujoks, C.K.,
Thermodynamic Properties of 2-Methylpentanol-2,
J. Am. Chem. Soc., 1933, 55, 12, 4820-4822, https://doi.org/10.1021/ja01339a012
. [all data]
Haas and Harrison, 1993
Haas, M.J.; Harrison, A.G.,
The Fragmentation of Proton-Bound Cluster Ions and the Gas-Phase Acidities of Alcohols,
Int. J. Mass Spectrom. Ion Proc., 1993, 124, 2, 115, https://doi.org/10.1016/0168-1176(93)80003-W
. [all data]
Boand, Houriet, et al., 1983
Boand, G.; Houriet, R.; Baumann, T.,
The gas phase acidity of aliphatic alcohols,
J. Am. Chem. Soc., 1983, 105, 2203. [all data]