(E)-1-Bromo-1-propene
- Formula: C3H5Br
- Molecular weight: 120.976
- IUPAC Standard InChIKey: NNQDMQVWOWCVEM-NSCUHMNNSA-N
- CAS Registry Number: 590-15-8
- Chemical structure:
View 3d structure (requires JavaScript / HTML 5) - Stereoisomers:

Gas phase thermochemistry data

Data compiled by: Hussein Y. Afeefy, Joel F. Liebman, and Stephen E. Stein
Quantity | Value | Units | Method | Reference | Comment |
---|---|---|---|---|---|
ΔfH°gas | 43.9 ± 4.2 | kJ/mol | Eqk | Alfassi, Golden, et al., 1973 | Reanalyzed by Pedley, Naylor, et al., 1986, Original value = 48.1 kJ/mol |

Reaction thermochemistry data

Data compiled by: Hussein Y. Afeefy, Joel F. Liebman, and Stephen E. Stein
Individual Reactions
By formula: C3H5Br = C3H5Br
Quantity | Value | Units | Method | Reference | Comment |
---|---|---|---|---|---|
ΔrH° | 3.1 ± 0.1 | kJ/mol | Ciso | Abell and Adolf, 1969 | gas phase; HBr catalyst |
By formula: C3H5Br = C3H5Br
Quantity | Value | Units | Method | Reference | Comment |
---|---|---|---|---|---|
ΔrH° | 1.3 ± 0.50 | kJ/mol | Eqk | Alfassi, Golden, et al., 1973 | gas phase |
By formula: C3H5Br = C3H5Br
Quantity | Value | Units | Method | Reference | Comment |
---|---|---|---|---|---|
ΔrH° | -1.84 ± 0.10 | kJ/mol | Eqk | Sharonov and Rozhnov, 1971 | gas phase |

References

Alfassi, Golden, et al., 1973
Alfassi, Z.B.; Golden, D.M.; Benson, S.W.,
The thermochemistry of the isomerization of 3-halopropenes (allyl halides) to 1-halopropenes; entropy and enthalpy of formation contribution of the Cd-(H)(X) group,
J. Chem. Thermodyn., 1973, 5, 411-420. [all data]
Pedley, Naylor, et al., 1986
Pedley, J.B.; Naylor, R.D.; Kirby, S.P.,
Thermochemical Data of Organic Compounds, Chapman and Hall, New York, 1986, 1-792. [all data]
Abell and Adolf, 1969
Abell, P.I.; Adolf, P.K.,
HBr catalyzed photoisomerization of allyl halides,
J. Chem. Thermodyn., 1969, 1, 333-338. [all data]
Sharonov and Rozhnov, 1971
Sharonov, K.G.; Rozhnov, A.M.,
Isomerization of 1-bromo-1-propenes,
Izv. Vyssh. Uchebn. Zaved., Khim. Khim. Tekhnol., 1971, 14, 577-560. [all data]