(Z)-1-Bromo-1-propene
- Formula: C3H5Br
- Molecular weight: 120.976
- IUPAC Standard InChIKey: NNQDMQVWOWCVEM-IHWYPQMZSA-N
- CAS Registry Number: 590-13-6
- Chemical structure:
- Stereoisomers:

Gas phase thermochemistry data

Data compiled by: Hussein Y. Afeefy, Joel F. Liebman, and Stephen E. Stein
Quantity | Value | Units | Method | Reference | Comment |
---|---|---|---|---|---|
ΔfH°gas | 9.7 ± 1.0 | kcal/mol | Eqk | Alfassi, Golden, et al., 1973 | Reanalyzed by Pedley, Naylor, et al., 1986, Original value = 10.7 kcal/mol |

Phase change data

Data compiled by: Robert L. Brown and Stephen E. Stein
Quantity | Value | Units | Method | Reference | Comment |
---|---|---|---|---|---|
Tboil | 331.0 | K | N/A | Weast and Grasselli, 1989 |

Reaction thermochemistry data

Data compiled by: Hussein Y. Afeefy, Joel F. Liebman, and Stephen E. Stein

Individual Reactions

(Z)-1-Bromo-1-propene = (E)-1-Bromo-1-propene

By formula: C3H5Br = C3H5Br

Quantity Value Units Method Reference Comment
Δr3.1 ± 0.1kJ/molCisoAbell and Adolf, 1969gas phase; HBr catalyst

(Z)-1-Bromo-1-propene = 1-Propene, 3-bromo-

By formula: C3H5Br = C3H5Br

Quantity Value Units Method Reference Comment
Δr4.5 ± 0.4kJ/molEqkAlfassi, Golden, et al., 1973gas phase

(E)-1-Bromo-1-propene = (Z)-1-Bromo-1-propene

By formula: C3H5Br = C3H5Br

Quantity Value Units Method Reference Comment
Δr-1.84 ± 0.10kJ/molEqkSharonov and Rozhnov, 1971gas phase

References

Alfassi, Golden, et al., 1973
Alfassi, Z.B.; Golden, D.M.; Benson, S.W.,
The thermochemistry of the isomerization of 3-halopropenes (allyl halides) to 1-halopropenes; entropy and enthalpy of formation contribution of the Cd-(H)(X) group,
J. Chem. Thermodyn., 1973, 5, 411-420. [all data]
Pedley, Naylor, et al., 1986
Pedley, J.B.; Naylor, R.D.; Kirby, S.P.,
Thermochemical Data of Organic Compounds, Chapman and Hall, New York, 1986, 1-792. [all data]
Weast and Grasselli, 1989
CRC Handbook of Data on Organic Compounds, 2nd Editon, Weast,R.C and Grasselli, J.G., ed(s)., CRC Press, Inc., Boca Raton, FL, 1989, 1. [all data]