Acetic acid, chloro-, butyl ester
- Formula: C6H11ClO2
- Molecular weight: 150.603
- IUPAC Standard InChIKey: YJRGMUWRPCPLNH-UHFFFAOYSA-N
- CAS Registry Number: 590-02-3
- Chemical structure:
View 3d structure (requires JavaScript / HTML 5) - Other names: n-Butyl chloroacetate; Butyl chloroacetate; Chloroacetic acid butyl ester; Monochloroacetic acid n-butyl ester; Chloroacetic acid n-butyl ester; 2-Chloroacetic acid, n-butyl ester

Condensed phase thermochemistry data

Data compiled by: Hussein Y. Afeefy, Joel F. Liebman, and Stephen E. Stein
Quantity | Value | Units | Method | Reference | Comment |
---|---|---|---|---|---|
ΔfH°liquid | -538. ± 1. | kJ/mol | Ccr | Bjellerup and Smith, 1954 | At 293 K |
Quantity | Value | Units | Method | Reference | Comment |
ΔcH°liquid | -3419. ± 1. | kJ/mol | Ccr | Bjellerup and Smith, 1954 | At 293 K |
ΔcH°liquid | -3418.3 ± 2.1 | kJ/mol | Ccb | Smith, Bjellerup, et al., 1953 | Reanalyzed by Cox and Pilcher, 1970, Original value = -3407. ± 2. kJ/mol |
ΔcH°liquid | -3410. ± 0.3 | kJ/mol | Ccr | Smith, Bjellerup, et al., 1953 | |
ΔcH°liquid | -3405. | kJ/mol | Ccb | Schjanberg, 1935 |

Phase change data

Data compiled as indicated in comments:
BS - Robert L. Brown and Stephen E. Stein
ALS - Hussein Y. Afeefy, Joel F. Liebman, and Stephen E. Stein
Quantity | Value | Units | Method | Reference | Comment |
---|---|---|---|---|---|
Tboil | 456.2 | K | N/A | Weast and Grasselli, 1989 | BS |
Quantity | Value | Units | Method | Reference | Comment |
ΔvapH° | 41. | kJ/mol | E | Schjanberg, 1935 | ALS |
Reduced pressure boiling point
Tboil (K) | Pressure (bar) | Reference | Comment |
---|---|---|---|
360. | 0.023 | American Tokyo Kasei, 1988 | BS |

References

Bjellerup and Smith, 1954
Bjellerup, L.; Smith, L.,
Heats of combustion of some organic chloro-compounds,
Kgl. Fysiograph. Sallskap. Lund Forh., 1954, 24, 1-13. [all data]
Smith, Bjellerup, et al., 1953
Smith, L.; Bjellerup, L.; Krook, S.; Westermark, H.,
Heats of combustion of organic chloro compounds determined by the "quartz wool" method,
Acta Chem. Scand., 1953, 7, 65. [all data]
Cox and Pilcher, 1970
Cox, J.D.; Pilcher, G.,
Thermochemistry of Organic and Organometallic Compounds, Academic Press, New York, 1970, 1-636. [all data]
Schjanberg, 1935
Schjanberg, E.,
Die Verbrennungswarmen und die Refraktionsdaten einiger chlorsubstituierter Fettsauren und Ester.,
Z. Phys. Chem. Abt. A, 1935, 172, 197-233. [all data]
Weast and Grasselli, 1989
CRC Handbook of Data on Organic Compounds, 2nd Editon, Weast,R.C and Grasselli, J.G., ed(s)., CRC Press, Inc., Boca Raton, FL, 1989, 1. [all data]
American Tokyo Kasei, 1988
American Tokyo Kasei,
TCI American Organic Chemical 88/89 Catalog, American Tokyo Kasei, Portland, OR, 1988, 1610. [all data]