Propanoic acid, butyl ester
- Formula: C7H14O2
- Molecular weight: 130.1849
- IUPAC Standard InChIKey: BTMVHUNTONAYDX-UHFFFAOYSA-N
- CAS Registry Number: 590-01-2
- Chemical structure:
View 3d structure (requires JavaScript / HTML 5) - Other names: Propionic acid, butyl ester; n-Butyl propionate; Butyl propionate; n-Butyl propanoate; Butyl propanoate; UN 1914; Butyl ester of propanoic acid; n-Butyl n-propionate; NSC 8449; Ucar solvent

Condensed phase thermochemistry data

Data compiled by: Hussein Y. Afeefy, Joel F. Liebman, and Stephen E. Stein
Quantity | Value | Units | Method | Reference | Comment |
---|---|---|---|---|---|
ΔcH°liquid | -4200.3 | kJ/mol | Ccb | Schjanberg, 1935 | Corresponding ΔfHºliquid = -555.2 kJ/mol (simple calculation by NIST; no Washburn corrections) |

Phase change data

Data compiled as indicated in comments:
BS - Robert L. Brown and Stephen E. Stein
TRC - Thermodynamics Research Center, NIST Boulder Laboratories, Chris Muzny director
ALS - Hussein Y. Afeefy, Joel F. Liebman, and Stephen E. Stein
AC - William E. Acree, Jr., James S. Chickos
Quantity | Value | Units | Method | Reference | Comment |
---|---|---|---|---|---|
Tboil | 419. ± 2. | K | AVG | N/A | Average of 7 values; Individual data points |
Quantity | Value | Units | Method | Reference | Comment |
Tc | 594.6 | K | N/A | Young, 1994 | Uncertainty assigned by TRC = 1. K; TRC |
Quantity | Value | Units | Method | Reference | Comment |
ΔvapH° | 39.1 ± 0.04 | kJ/mol | V | Mathews, 1926 | ALS |
Reduced pressure boiling point
Tboil (K) | Pressure (bar) | Reference | Comment |
---|---|---|---|
418.2 | 1.01 | Aldrich Chemical Company Inc., 1990 | BS |
Enthalpy of vaporization
ΔvapH (kJ/mol) | Temperature (K) | Method | Reference | Comment |
---|---|---|---|---|
49.1 | 320. | A | Stephenson and Malanowski, 1987 | Based on data from 305. to 417. K.; AC |
47.4 | 320. | N/A | Usanovich and Dembitskii, 1959 | Based on data from 305. to 365. K. See also Boublik, Fried, et al., 1984.; AC |
Antoine Equation Parameters
log10(P) = A − (B / (T + C))
P = vapor pressure (bar)
T = temperature (K)
View plot Requires a JavaScript / HTML 5 canvas capable browser.
Temperature (K) | A | B | C | Reference | Comment |
---|---|---|---|---|---|
305.6 to 366.1 | 5.52282 | 2122.74 | -25.513 | Usanovich and Dembitskii, 1959, 2 | Coefficents calculated by NIST from author's data. |

Van Den Dool and Kratz RI, non-polar column, temperature ramp

Data compiled by: NIST Mass Spectrometry Data Center, William E. Wallace, director

Column type CapillaryCapillaryCapillaryCapillaryCapillary
Active phase SPB-5HP-5HP-5MSBPX-5CP Sil 5 CB
Column length (m) 30.30.30.25.50.
Carrier gas HeHeHeHeHe
Substrate
Column diameter (mm) 0.250.250.250.220.32
Phase thickness (μm) 0.250.250.250.250.4
Tstart (C) 50.50.60.50.60.
Tend (C) 220.250.250.300.280.
Heat rate (K/min) 20.4.4.5.3.
Initial hold (min) 2.4.2.5.10.
Final hold (min) 2.10.20. 60.
I 909.910.910.918.888.
ReferenceBalbontin, Gaete-Eastman, et al., 2007Quijano, Salamanca, et al., 2007Pino, Mesa, et al., 2005Dickschat, Wenzel, et al., 2004Pino, Marbot, et al., 2002
Comment MSDC-RI MSDC-RI MSDC-RI MSDC-RI MSDC-RI
Column type CapillaryCapillary
Active phase DB-5SE-52
Column length (m) 30.150.
Carrier gas HeHe
Substrate
Column diameter (mm) 0.250.6
Phase thickness (μm)
Tstart (C) 50.10.
Tend (C) 250.200.
Heat rate (K/min) 3.1.
Initial hold (min)
Final hold (min)
I 908.911.
ReferenceIsidorov, Zenkevich, et al., 2001de Pooter, Montens, et al., 1983
Comment MSDC-RI MSDC-RI

Kovats' RI, polar column, isothermal

Data compiled by: NIST Mass Spectrometry Data Center, William E. Wallace, director

Column type CapillaryCapillaryCapillaryCapillaryCapillary
Active phase OV-351OV-351OV-351OV-351SP-1000
Column length (m) 25.25.25.25.46.
Carrier gas N2N2N2N2N2
Substrate
Column diameter (mm) 0.320.320.320.320.23
Phase thickness (μm)
Temperature (C) 100.120.140.80.100.
I 1159.1145.1178.1139.1138.
ReferenceHaken and Korhonen, 1985Haken and Korhonen, 1985Haken and Korhonen, 1985Haken and Korhonen, 1985Horna, Táborský, et al., 1985
Comment MSDC-RI MSDC-RI MSDC-RI MSDC-RI MSDC-RI
Column type PackedPacked
Active phase Carbowax 20MCarbowax 20M
Column length (m) 3.2.
Carrier gas
Substrate Chromosorb WAW (60-80 mesh)Chromosorb W
Column diameter (mm)
Phase thickness (μm)
Temperature (C) 100.100.
I 1137.1151.
ReferenceChastrette, Heintz, et al., 1974Zarazir, Chovin, et al., 1970
Comment MSDC-RI MSDC-RI

Kovats' RI, non-polar column, custom temperature program

Data compiled by: NIST Mass Spectrometry Data Center, William E. Wallace, director

Column type CapillaryCapillary
Active phase SE-54SE-30
Column length (m) 50.
Carrier gas
Substrate
Column diameter (mm) 0.21
Phase thickness (μm)
Program 50C (10min) => 2C/min => 75C => 3C/min => 150C => 5C/min => 200Cnot specified
I 912.886.
ReferenceJanzanntti, Franco, et al., 2000Chretien and Dubois, 1978
Comment MSDC-RI MSDC-RI

Normal alkane RI, polar column, isothermal

Data compiled by: NIST Mass Spectrometry Data Center, William E. Wallace, director

Column type Packed
Active phase Carbowax 20M
Column length (m)
Carrier gas
Substrate
Column diameter (mm)
Phase thickness (μm)
Temperature (C) 100.
I 1139.
ReferenceYabumoto, Jennings, et al., 1977
Comment MSDC-RI

Normal alkane RI, non-polar column, isothermal

Data compiled by: NIST Mass Spectrometry Data Center, William E. Wallace, director

Column type Packed
Active phase SE-30
Column length (m)
Carrier gas
Substrate
Column diameter (mm)
Phase thickness (μm)
Temperature (C) 70.
I 899.
ReferenceYabumoto, Jennings, et al., 1977
Comment MSDC-RI

References

Schjanberg, 1935
Schjanberg, E.,
Die Verbrennungswarmen und die Refraktionsdaten einiger chlorsubstituierter Fettsauren und Ester.,
Z. Phys. Chem. Abt. A, 1935, 172, 197-233. [all data]
Young, 1994
Young, C.L.,
Personal Commun. 1994 1994, 1994. [all data]
Mathews, 1926
Mathews, J.H.,
The accurate measurement of heats of vaporization of liquids,
J. Am. Chem. Soc., 1926, 48, 562-576. [all data]
Aldrich Chemical Company Inc., 1990
Aldrich Chemical Company Inc.,
Catalog Handbook of Fine Chemicals, Aldrich Chemical Company, Inc., Milwaukee WI, 1990, 1. [all data]
Stephenson and Malanowski, 1987
Stephenson, Richard M.; Malanowski, Stanislaw,
Handbook of the Thermodynamics of Organic Compounds, 1987, https://doi.org/10.1007/978-94-009-3173-2
. [all data]
Usanovich and Dembitskii, 1959
Usanovich, M.; Dembitskii, A.I.,
Zh. Obshch. Khim., 1959, 29, 1771. [all data]
Boublik, Fried, et al., 1984
Boublik, T.; Fried, V.; Hala, E.,
The Vapour Pressures of Pure Substances: Selected Values of the Temperature Dependence of the Vapour Pressures of Some Pure Substances in the Normal and Low Pressure Region, 2nd ed., Elsevier, New York, 1984, 972. [all data]
Usanovich and Dembitskii, 1959, 2
Usanovich, M.; Dembitskii, A.,
Vapor Pressure of Systems of Tin Chloride with Ethers,
Zh. Obshch. Khim., 1959, 29, 1771-1781. [all data]