H2CCl+
- Formula: CH2Cl+
- Molecular weight: 49.479
- CAS Registry Number: 59000-00-9

Ion clustering data

Data compiled by: Michael M. Meot-Ner (Mautner) and Sharon G. Lias
Clustering reactions
By formula: CH2Cl+ + CH3Cl = (CH2Cl+ • CH3Cl)
Quantity | Value | Units | Method | Reference | Comment |
---|---|---|---|---|---|
ΔrH° | 6.9 | kcal/mol | HPMS | Luczynski, Malicki, et al., 1974 | gas phase; DG from graph, Entropy change is questionable |
Quantity | Value | Units | Method | Reference | Comment |
ΔrS° | -3.7 | cal/mol*K | HPMS | Luczynski, Malicki, et al., 1974 | gas phase; DG from graph, Entropy change is questionable |
Free energy of reaction
ΔrG° (kcal/mol) | T (K) | Method | Reference | Comment |
---|---|---|---|---|
8.1 | 312. | HPMS | Luczynski, Malicki, et al., 1974 | gas phase; DG from graph, Entropy change is questionable |
By formula: (CH2Cl+ • CH3Cl) + CH3Cl = (CH2Cl+ • 2CH3Cl)
Quantity | Value | Units | Method | Reference | Comment |
---|---|---|---|---|---|
ΔrH° | 5.7 | kcal/mol | HPMS | Luczynski, Malicki, et al., 1974 | gas phase; DG from graph, Entropy change is questionable |
Quantity | Value | Units | Method | Reference | Comment |
ΔrS° | 6.9 | cal/mol*K | HPMS | Luczynski, Malicki, et al., 1974 | gas phase; DG from graph, Entropy change is questionable |
Free energy of reaction
ΔrG° (kcal/mol) | T (K) | Method | Reference | Comment |
---|---|---|---|---|
4.4 | 182. | HPMS | Luczynski, Malicki, et al., 1974 | gas phase; DG from graph, Entropy change is questionable |

Reaction thermochemistry data

Data compiled by: Michael M. Meot-Ner (Mautner) and Sharon G. Lias

Individual Reactions

(CH2Cl+ • Chloromethane) + Chloromethane = (CH2Cl+ • 2Chloromethane)

By formula: (CH2Cl+ • CH3Cl) + CH3Cl = (CH2Cl+ • 2CH3Cl)

Quantity Value Units Method Reference Comment
Δr24.kJ/molHPMSLuczynski, Malicki, et al., 1974gas phase; DG from graph, Entropy change is questionable
Quantity Value Units Method Reference Comment
Δr29.J/mol*KHPMSLuczynski, Malicki, et al., 1974gas phase; DG from graph, Entropy change is questionable

Free energy of reaction

ΔrG° (kJ/mol) T (K) Method Reference Comment
18.182.HPMSLuczynski, Malicki, et al., 1974gas phase; DG from graph, Entropy change is questionable

CH2Cl+ + Chloromethane = (CH2Cl+ • Chloromethane)

By formula: CH2Cl+ + CH3Cl = (CH2Cl+ • CH3Cl)

Quantity Value Units Method Reference Comment
Δr29.kJ/molHPMSLuczynski, Malicki, et al., 1974gas phase; DG from graph, Entropy change is questionable
Quantity Value Units Method Reference Comment
Δr-15.J/mol*KHPMSLuczynski, Malicki, et al., 1974gas phase; DG from graph, Entropy change is questionable

Free energy of reaction

ΔrG° (kJ/mol) T (K) Method Reference Comment
34.312.HPMSLuczynski, Malicki, et al., 1974gas phase; DG from graph, Entropy change is questionable

Vibrational and/or electronic energy levels

Data compiled by: Marilyn E. Jacox

State:   X

Vib.
sym.
 No.   Approximate
 type of mode
 cm-1   Med.   Method   References

a1 1 CH2 s-stretch 2987.3 w m Ar IR Ma, Chen, et al., 2009
3 CCl stretch 1040 ± 30 gas PE Andrews, Dyke, et al., 1983
Andrews, Dyke, et al., 1984
3 CCl stretch 1037.6 vs Ar IR Ma, Chen, et al., 2009
b1 4 CH2 wag 1110.2 w m Ar IR Ma, Chen, et al., 2009
b2 5 CH2 a-stretch 3109.3 m s Ar IR Ma, Chen, et al., 2009

Additional references: Jacox, 1994, page 147

References

Luczynski, Malicki, et al., 1974
Luczynski, Z.; Malicki, W.; Wincel, H.,
Positive Ion Reactions of Methyl Cloride in the Gas Phase,
Int. J. Mass Spectrom. Ion Phys., 1974, 15, 3, 321, https://doi.org/10.1016/0020-7381(74)85009-6
. [all data]