3-Octanol
- Formula: C8H18O
- Molecular weight: 130.2279
- IUPAC Standard InChIKey: NMRPBPVERJPACX-UHFFFAOYSA-N
- CAS Registry Number: 589-98-0
- Chemical structure:
View 3d structure (requires JavaScript / HTML 5) - Species with the same structure:
- Stereoisomers:
- Other names: n-Octan-3-ol; Ethylamylcarbinol; Amylethylcarbinol; Ethyl-n-amylcarbinol; Octanol-3; D-n-Octanol; Octan-3-ol

Condensed phase thermochemistry data

Data compiled by: Eugene S. Domalski and Elizabeth D. Hearing
Constant pressure heat capacity of liquid
Cp,liquid (J/mol*K) | Temperature (K) | Reference | Comment |
---|---|---|---|
338.5 | 298.5 | Cline and Andrews, 1931 | T = 102 to 298 K. Value is unsmoothed experimental datum. |

Phase change data

Data compiled as indicated in comments:
TRC - Thermodynamics Research Center, NIST Boulder Laboratories, Chris Muzny director
Quantity | Value | Units | Method | Reference | Comment |
---|---|---|---|---|---|
Tc | 628.5 ± 0.5 | K | N/A | Gude and Teja, 1995 | |
Tc | 628.5 | K | N/A | Teja, Lee, et al., 1989 | TRC |
Tc | 628.45 | K | N/A | Anselme and Teja, 1988 | Uncertainty assigned by TRC = 0.3 K; TRC |
Quantity | Value | Units | Method | Reference | Comment |
Vc | 0.515 | l/mol | N/A | Gude and Teja, 1995 | |
Quantity | Value | Units | Method | Reference | Comment |
ρc | 1.94 | mol/l | N/A | Gude and Teja, 1995 | |
ρc | 1.94 | mol/l | N/A | Anselme and Teja, 1988 | Uncertainty assigned by TRC = 0.05 mol/l; TRC |
Antoine Equation Parameters
log10(P) = A − (B / (T + C))
P = vapor pressure (bar)
T = temperature (K)
View plot Requires a JavaScript / HTML 5 canvas capable browser.
Temperature (K) | A | B | C | Reference | Comment |
---|---|---|---|---|---|
283. to 353. | 4.8465 | 1663.322 | -97.47 | Geiseler, Fruwert, et al., 1966 | Coefficents calculated by NIST from author's data. |

Kovats' RI, non-polar column, isothermal

View large format table.

Column type Active phase Temperature (C) I Reference Comment
CapillaryOV-101150.985.4Cha and Lee, 1994Column length: 20. m; Column diameter: 0.5 mm
CapillaryOV-101180.990.0Cha and Lee, 1994Column length: 20. m; Column diameter: 0.5 mm

Kovats' RI, non-polar column, temperature ramp

View large format table.

Column type Active phase I Reference Comment
CapillaryHP-5996.Oliveira, Leitao, et al., 200625. m/0.2 mm/0.33 μm, 3. K/min; Tstart: 60. C; Tend: 240. C
CapillaryHP-5MS994.Juliani, Zygadlo, et al., 200430. m/0.25 mm/0.25 μm, He, 60. C @ 1. min, 4. K/min, 200. C @ 15. min
CapillaryDB-1990.Velasco-Negueruela, Sanz, et al., 200450. m/0.25 mm/0.25 μm, N2, 4. K/min; Tstart: 95. C; Tend: 240. C
CapillaryBP-1985.Rajeswara Rao, 200225. m/0.5 mm/0.25 μm, N2, 5. K/min, 220. C @ 10. min; Tstart: 60. C
CapillaryBP-1985.Rao B.R.R., 200225. m/0.5 mm/0.25 μm, 5. K/min, 220. C @ 10. min; Tstart: 60. C
CapillaryHP-5993.Kitic, Palic, et al., 200125. m/0.32 mm/0.52 μm, H2, 4. K/min; Tstart: 40. C; Tend: 240. C
CapillaryDB-5992.Tzakou, Harvala, et al., 200050. C @ 5. min, 3. K/min; Column length: 30. m; Column diameter: 0.32 mm; Tend: 250. C
CapillaryDB-5994.da Silva, Andrade, et al., 199930. m/0.25 mm/0.25 μm, He, 3. K/min; Tstart: 60. C; Tend: 240. C
CapillaryHP-11013.Raharivelomanana, Cambon, et al., 19936. K/min, 240. C @ 10. min; Column length: 15. m; Column diameter: 0.32 mm; Tstart: 40. C
CapillaryOV-101980.Ohnishi and Shibamoto, 19842. K/min; Column length: 50. m; Column diameter: 0.23 mm; Tstart: 80. C; Tend: 200. C
CapillaryOV-101982.Ohnishi and Shibamoto, 19842. K/min; Column length: 50. m; Column diameter: 0.23 mm; Tstart: 80. C; Tend: 200. C

Kovats' RI, non-polar column, custom temperature program

View large format table.

Column type Active phase I Reference Comment
CapillaryAT-5997.Rojas and Usubillaga, 200060. m/0.25 mm/0.25 μm, He; Program: 60 C (1 min) 4 K/min -> 200 C 10 K/min -> 280 C

Kovats' RI, polar column, isothermal

View large format table.

Column type Active phase Temperature (C) I Reference Comment
PackedCarbowax 20M130.1356.Singliar, 1972Column length: 2.55 m
PackedCarbowax 20M165.1359.Singliar, 1972Column length: 2.55 m

Kovats' RI, polar column, temperature ramp

View large format table.

Column type Active phase I Reference Comment
CapillaryPE-Wax1383.Chandravadana, Vekateshwarlu, et al., 2005N2, 60. C @ 4. min, 5. K/min, 200. C @ 5. min; Column length: 30. m; Column diameter: 0.25 mm
CapillaryInnowax1386.Mahmood, Kaul, et al., 200430. m/0.25 mm/0.25 μm, He, 5. K/min, 190. C @ 5. min; Tstart: 40. C
CapillaryPE-Wax1383.Venkateshwarlu, Chandravadana, et al., 1999N2, 60. C @ 4. min, 5. K/min, 200. C @ 5. min; Column length: 30. m; Column diameter: 0.25 mm
CapillaryCarbowax 20M1390.Buttery, Kamm, et al., 1982He, 50. C @ 30. min, 1. K/min; Column length: 150. m; Column diameter: 0.64 mm; Tend: 170. C
CapillaryCarbowax 20M1390.Buttery, Kamm, et al., 1982He, 50. C @ 30. min, 1. K/min; Column length: 150. m; Column diameter: 0.64 mm; Tend: 170. C

Kovats' RI, polar column, custom temperature program

View large format table.

Column type Active phase I Reference Comment
CapillaryCarbowax 20M1398.Brander, Kepner, et al., 1980Program: not specified
CapillaryCarbowax 20M1398.Brander, Kepner, et al., 1980Program: not specified

Van Den Dool and Kratz RI, non-polar column, temperature ramp

View large format table.

Column type Active phase I Reference Comment
CapillaryDB-5MS996.Cho, Namgung, et al., 200830. m/0.25 mm/0.25 μm, He, 40. C @ 1. min, 4. K/min, 200. C @ 10. min
CapillaryDB-5MS996.Cho, Namgung, et al., 200830. m/0.25 mm/0.25 μm, He, 40. C @ 1. min, 4. K/min, 200. C @ 10. min
CapillaryDB-5MS1007.Cho I.H., Lee S.M., et al., 200730. m/0.25 mm/0.25 μm, He, 40. C @ 1. min, 4. K/min, 200. C @ 10. min
CapillaryDB-5995.Martins, Santos, et al., 200730. m/0.22 mm/0.25 μm, 60. C @ 2. min, 3. K/min; Tend: 240. C
CapillaryHP-5MS995.Vagionas, Ngassapa, et al., 200730. m/0.25 mm/0.25 μm, He, 3. K/min; Tstart: 60. C; Tend: 280. C
CapillaryDB-5MS1007.Cho, Kim, et al., 200630. m/0.25 mm/0.25 μm, He, 40. C @ 1. min, 4. K/min, 200. C @ 10. min
CapillaryDB-1985.Kuiate, Bessière, et al., 200630. m/0.25 mm/0.25 μm, N2, 4. K/min; Tstart: 50. C; Tend: 220. C
CapillaryHP-5MS989.Kukic J., Petrovic S., et al., 200630. m/0.25 mm/0.25 μm, He, 3. K/min; Tstart: 60. C; Tend: 280. C
CapillaryHP-5MS995.9Zhao C.X., Li, et al., 200630. m/0.25 mm/0.25 μm, He, 4. K/min; Tstart: 80. C; Tend: 300. C
CapillaryCP Sil 5 CB981.Ziegenbein, Hanssen, et al., 200625. m/0.25 mm/0.4 μm, He, 10. K/min; Tstart: 80. C; Tend: 270. C
CapillarySE-54991.Brantner, Pfeifhofer, et al., 200550. m/0.25 mm/0.27 μm, H2, 5. K/min; Tstart: 50. C; Tend: 300. C
CapillaryHP-5995.Flamini, Luigi Cioni, et al., 200530. m/0.25 mm/0.25 μm, N2, 60. C @ 10. min, 5. K/min; Tend: 220. C
CapillaryHP-5994.Flamini, Luigi Cioni, et al., 2005, 230. m/0.25 mm/0.25 μm, N2, 60. C @ 10. min, 5. K/min; Tend: 220. C
CapillaryDB-5988.Wu, Zorn, et al., 200530. m/0.32 mm/0.25 μm, He, 40. C @ 2. min, 5. K/min, 250. C @ 5. min
CapillaryHP-5MS995.Aligiannis, Kalpoutzakis, et al., 200430. m/0.25 mm/0.25 μm, He, 3. K/min; Tstart: 60. C; Tend: 280. C
CapillaryHP-5999.Bertoli, Pistelli, et al., 200430. m/0.25 mm/0.25 μm, N2, 60. C @ 10. min, 5. K/min; Tend: 220. C
CapillaryHP-5MS991.Chorianopoulos, Kalpoutzakis, et al., 200430. m/0.25 mm/0.25 μm, He, 3. K/min; Tstart: 60. C; Tend: 280. C
CapillaryHP-5995.Flamini, Luigi Cioni, et al., 200430. m/0.25 mm/0.25 μm, N2, 60. C @ 10. min, 5. K/min; Tend: 220. C
CapillaryDB-5995.Javidnia, Miri, et al., 200430. m/0.25 mm/0.25 μm, He, 3. K/min; Tstart: 60. C; Tend: 260. C
CapillaryRSL-200988.Ngassoum, Ousmaila, et al., 200430. m/0.32 mm/0.25 μm, H2, 40. C @ 5. min, 6. K/min, 280. C @ 5. min
CapillaryHP-5998.Sartoratto, Machado, et al., 200425. m/0.2 mm/0.33 μm, He, 3. K/min, 240. C @ 7. min; Tstart: 60. C
CapillaryDB-5995.Bader, Caponi, et al., 200330. m/0.25 mm/0.25 μm, He, 3. K/min, 240. C @ 30. min; Tstart: 60. C
CapillaryDB-5995.Javidnia, Miri, et al., 2003He, 4. K/min; Column length: 25. m; Column diameter: 0.25 mm; Tstart: 60. C; Tend: 260. C
CapillaryHP-5993.Ngassapa, Runyoro, et al., 200330. m/0.25 mm/0.25 μm, He, 3. K/min; Tstart: 60. C; Tend: 280. C
CapillaryHP-5MS993.Salido, Altarejos, et al., 200330. m/0.25 mm/0.25 μm, He, 3. K/min; Tstart: 50. C; Tend: 250. C
CapillaryHP-5993.Skaltsa, Demetzos, et al., 200330. m/0.25 mm/0.25 μm, He, 60. C @ 5. min, 4. K/min; Tend: 280. C
CapillaryDB-5993.Economakis, Skaltsa, et al., 200230. m/0.25 mm/0.25 μm, 50. C @ 5. min, 3. K/min; Tend: 280. C
CapillaryDB-5993.Miri, Ramezani, et al., 2002He, 4. K/min; Column length: 25. m; Column diameter: 0.25 mm; Tstart: 70. C; Tend: 260. C
CapillaryRTX-5997.Mondello, Zappia, et al., 200230. m/0.25 mm/0.25 μm, He, 45. C @ 6. min, 3. K/min, 300. C @ 10. min
CapillaryRTX-51004.Shellie, Mondello, et al., 200230. m/0.25 mm/0.25 μm, He, 45. C @ 6. min, 3. K/min; Tend: 250. C
CapillaryRTX-5993.Shellie, Mondello, et al., 200230. m/0.25 mm/0.25 μm, He, 45. C @ 6. min, 3. K/min; Tend: 250. C
CapillaryHP-5996.Aligiannis, Kalpoutzakis, et al., 200130. m/0.25 mm/0.25 μm, He, 60. C @ 5. min, 3. K/min; Tend: 280. C
CapillaryHP-5994.Aligiannis, Kalpoutzakis, et al., 2001, 230. m/0.25 mm/0.25 μm, He, 60. C @ 5. min, 3. K/min; Tend: 280. C
CapillaryHP-1997.Guilliard, Delgado, et al., 200160. m/0.25 mm/0.25 μm, He, 50. C @ 5. min, 2.5 K/min; Tend: 250. C
CapillaryHP-5993.Guilliard, Delgado, et al., 200150. m/0.25 mm/0.25 μm, He, 50. C @ 5. min, 2.5 K/min; Tend: 250. C
CapillaryCP Sil 5 CB981.Pino and Marbot, 200150. m/0.32 mm/0.4 μm, He, 60. C @ 10. min, 3. K/min, 280. C @ 60. min
CapillaryHP-5MS993.Skaltsa, Mavrommati, et al., 200130. m/0.25 mm/0.25 μm, He, 60. C @ 5. min, 4. K/min; Tend: 280. C
CapillaryBP-1977.Baldovini, Ristorcelli, et al., 200050. m/0.22 mm/0.25 μm, 2. K/min, 220. C @ 20. min; Tstart: 60. C
CapillaryHP-5994.Lazari, Skaltsa, et al., 199930. m/0.25 mm/0.25 μm, He, 50. C @ 5. min, 4. K/min; Tend: 280. C
CapillaryDB-1982.Warthen, Lee, et al., 199725. m/0.2 mm/0.11 μm, He, 5. K/min; Tstart: 50. C; Tend: 250. C
CapillaryDB-1985.Warthen, Lee, et al., 199725. m/0.2 mm/0.11 μm, He, 5. K/min; Tstart: 50. C; Tend: 250. C
CapillaryDB-1979.Coen, Engel, et al., 199530. m/0.32 mm/0.25 μm, N2, 3. K/min; Tstart: 150. C; Tend: 280. C
CapillaryHP-101995.Chung, Eiserich, et al., 1993N2, 3. K/min; Column length: 50. m; Column diameter: 0.25 mm; Tstart: 70. C; Tend: 200. C
CapillaryOV-101978.Pieribattesti, Smadja, et al., 1988H2, 2. K/min; Column length: 50. m; Column diameter: 0.32 mm; Tstart: 50. C; Tend: 200. C
CapillaryOV-1986.Schreyen, Dirinck, et al., 19761. K/min; Column length: 183. m; Column diameter: 0.762 mm; Tstart: 0. C; Tend: 230. C

Van Den Dool and Kratz RI, non-polar column, custom temperature program

View large format table.

Column type Active phase I Reference Comment
Capillary5 % Phenyl methyl siloxane993.Sacchetti, Maietti, et al., 200530. m/0.32 mm/0.15 μm, He; Program: 45C => 1C/min => 100C => 5C/min => 250C (10min)
CapillaryHP-5982.Boué, Shih, et al., 200350. m/0.2 mm/0.5 μm, He; Program: 40C(3min) => 10C/min => 60C =3C/min => 150C => 20C/min => 250C (5min)
CapillaryHP-5990.García, Alvarez, et al., 200250. m/0.2 mm/0.33 μm, He; Program: 50C(2min) => 5C/min => 150C => 10C/min => 250C(30min)
CapillarySE-52994.Lorenzo, Paz, et al., 200230. m/0.32 mm/0.42 μm, H2; Program: 60C(8min) => 3C/min => 180C => 20C/min => 250C(10min)
CapillaryDB-5MS971.Boulanger and Crouzet, 200130. m/0.25 mm/0.25 μm, H2; Program: 40C (5min) => 2C/min => 200C => 5C/min => 250C (15min)
CapillaryDB-5MS980.Boulanger and Crouzet, 200130. m/0.25 mm/0.25 μm, H2; Program: 40C (5min) => 2C/min => 200C => 5C/min => 250C (15min)

Van Den Dool and Kratz RI, polar column, temperature ramp

View large format table.

Column type Active phase I Reference Comment
CapillaryDB-Wax1396.Cho, Namgung, et al., 200830. m/0.25 mm/0.25 μm, He, 40. C @ 1. min, 4. K/min, 200. C @ 10. min
CapillaryDB-Wax1394.Cho, Namgung, et al., 200830. m/0.25 mm/0.25 μm, He, 40. C @ 1. min, 4. K/min, 200. C @ 10. min
CapillaryDB-Wax1394.Cho I.H., Lee S.M., et al., 200760. m/0.25 mm/0.25 μm, He, 40. C @ 1. min, 4. K/min, 200. C @ 10. min
CapillaryDB-Wax1396.Cho, Choi, et al., 200660. m/0.25 mm/0.25 μm, He, 40. C @ 1. min, 4. K/min, 200. C @ 10. min
CapillaryDB-Wax1400.Cho, Choi, et al., 200660. m/0.25 mm/0.25 μm, He, 40. C @ 1. min, 4. K/min, 200. C @ 10. min
CapillaryDB-Wax1394.Cho, Kim, et al., 200660. m/0.25 mm/0.25 μm, He, 40. C @ 1. min, 4. K/min, 200. C @ 10. min
CapillaryFFAP1423.Agnihotri, Agarwal, et al., 200520. m/0.25 mm/0.25 μm, He, 90. C @ 2. min, 4. K/min; Tend: 220. C
CapillaryStabilwax1383.Cros, Lignot, et al., 200560. m/0.25 mm/0.25 μm, He, 40. C @ 5. min, 3. K/min, 240. C @ 10. min
CapillaryZB-Wax1389.Wu, Zorn, et al., 200530. m/0.32 mm/0.25 μm, He, 40. C @ 2. min, 5. K/min, 250. C @ 5. min
CapillaryHP-Wax1395.Flamini, Luigi Cioni, et al., 200430. m/0.25 mm/0.25 μm, N2, 60. C @ 10. min, 5. K/min; Tend: 220. C
CapillaryZB-Wax1392.Ledauphin, Saint-Clair, et al., 200430. m/0.25 mm/0.15 μm, He, 35. C @ 10. min, 1.8 K/min, 220. C @ 10. min
CapillaryHP-Wax1395.Bader, Caponi, et al., 200330. m/0.25 mm/0.25 μm, N2, 60. C @ 10. min, 5. K/min; Tend: 220. C
CapillaryStabilwax1383.Cros, Vandanjon, et al., 200360. m/0.25 mm/0.25 μm, He, 40. C @ 5. min, 3. K/min, 240. C @ 10. min
CapillaryDB-Wax1427.Claudela, Dirningera, et al., 200260. m/0.32 mm/0.5 μm, He, 2.7 K/min, 235. C @ 30. min; Tstart: 67. C
CapillaryRTX-Wax1384.Mondello, Zappia, et al., 200230. m/0.25 mm/0.25 μm, He, 45. C @ 6. min, 3. K/min, 250. C @ 10. min
CapillaryRTX-Wax1387.Shellie, Mondello, et al., 200230. m/0.25 mm/0.25 μm, He, 45. C @ 6. min, 3. K/min; Tend: 250. C
CapillaryRTX-Wax1398.Shellie, Mondello, et al., 200230. m/0.25 mm/0.25 μm, He, 45. C @ 6. min, 3. K/min; Tend: 250. C
CapillaryAT-Wax1380.Pino and Marbot, 200160. m/0.32 mm/0.25 μm, He, 65. C @ 10. min, 2. K/min, 250. C @ 60. min
CapillaryBP-201381.Baldovini, Ristorcelli, et al., 200050. m/0.22 mm/0.25 μm, 2. K/min, 220. C @ 20. min; Tstart: 60. C
CapillaryDB-Wax1397.Kim, Thuy, et al., 200030. m/0.25 mm/0.25 μm, He, 40. C @ 5. min, 2. K/min, 200. C @ 20. min
CapillarySupelcowax-101395.Chung, 199960. m/0.25 mm/0.25 μm, He, 35. C @ 5. min, 2. K/min, 195. C @ 90. min
CapillaryDB-Wax1400.Brophy, Forster, et al., 1998He, 3. K/min; Column length: 60. m; Column diameter: 0.32 mm; Tstart: 35. C; Tend: 220. C
CapillaryDB-Wax1406.Mau, Lin, et al., 199860. m/0.32 mm/0.25 μm, 2. K/min; Tstart: 40. C; Tend: 200. C
CapillaryDB-Wax1406.Mau, Chyau, et al., 199730. m/0.53 mm/0.25 μm, N2, 2. K/min, 200. C @ 40. min; Tstart: 40. C
CapillaryDB-Wax1406.Mau and Hwang, 199730. m/0.53 mm/0.25 μm, N2, 2. K/min; Tstart: 50. C; Tend: 200. C
CapillaryDB-Wax1404.Coen, Engel, et al., 199530. m/0.32 mm/0.5 μm, He, 2. K/min; Tstart: 50. C; Tend: 230. C
CapillaryHP-20M1368.Chung, Eiserich, et al., 1993He, 3. K/min; Column length: 50. m; Column diameter: 0.25 mm; Tstart: 60. C; Tend: 190. C
CapillaryHP-FFAP1400.Chung, Eiserich, et al., 1993He, 3. K/min; Column length: 50. m; Column diameter: 0.25 mm; Tstart: 60. C; Tend: 210. C

Van Den Dool and Kratz RI, polar column, custom temperature program

View large format table.

Column type Active phase I Reference Comment
CapillaryCP-Wax 52CB1386.Romeo, Ziino, et al., 200760. m/0.25 mm/0.25 μm, He; Program: 45C(5min) => 10C/min => 80C => 2C/min => 240C
CapillaryDB-Wax1385.Ferrari, Lablanquie, et al., 200460. m/0.25 mm/0.25 μm, He; Program: 35C(0.7min) => 20C/min => 70C => 4C/min => 240C
CapillaryDB-Wax1395.Pennarun, Prost, et al., 200330. m/0.32 mm/0.5 μm, He; Program: 50C => 6C/min => 70C => 4C/min => 150C => 10C/min => 250C
CapillaryCarbowax 20M1380.Lorenzo, Paz, et al., 200225. m/0.32 mm/0.25 μm, H2; Program: 40C(8min) => 3C/min => 180C => 20C/min => 230C
CapillaryDB-Wax1395.Pennarun, Prost, et al., 200230. m/0.32 mm/0.5 μm, He; Program: 50C => 6C/min => 70C => 4C/min => 150C => 10C/min => 250C
CapillaryDB-Wax1396.Boulanger and Crouzet, 200130. m/0.25 mm/0.25 μm, H2; Program: 60C (3min) => 2C/min => 220C => 5C/min => 250C (15min)
CapillaryDB-Wax1392.Boulanger and Crouzet, 200130. m/0.25 mm/0.25 μm, H2; Program: 60C (3min) => 2C/min => 220C => 5C/min => 250C (15min)
CapillaryDB-Wax1385.Cantergiani, Brevard, et al., 200130. m/0.25 mm/0.25 μm; Program: 20C(30s) => fast => 60C => 4C/min => 220C (20min)
CapillaryHP-Innowax1400.Bisio, Ciarallo, et al., 199830. m/0.25 mm/0.25 μm, He; Program: 60C(8min) => 3C/min => 180C(5min) => 40C/min => 250C
CapillaryDB-Wax1417.8Yang, Chyau, et al., 1998He; Column length: 50. m; Column diameter: 0.32 mm; Program: 50C => 2.5C/min => 150C => 1.5C/min => 210C
CapillaryDB-Wax1417.8Yang, Chyau, et al., 1998He; Column length: 50. m; Column diameter: 0.32 mm; Program: 50C => 2.5C/min => 150C => 1.5C/min => 210C
CapillaryCarbowax 20M1386.Whitfield, Shea, et al., 1981Column length: 150. m; Column diameter: 0.75 mm; Program: not specified

Normal alkane RI, non-polar column, temperature ramp

View large format table.

Column type Active phase I Reference Comment
CapillaryHP-1995.Alizadeh and Shaabani, 201230. m/0.25 mm/0.25 μm, Helium, 3. K/min; Tstart: 60. C; Tend: 240. C
CapillaryDB-51002.Silva, Suzuki, et al., 201235. m/0.20 mm/0.10 μm, Helium, 4. K/min; Tstart: 50. C; Tend: 200. C
CapillaryDB-5993.Silva, Suzuki, et al., 201235. m/0.20 mm/0.10 μm, Helium, 4. K/min; Tstart: 50. C; Tend: 200. C
CapillaryHP-5995.Bertoli, Lepnardi, et al., 201130. m/0.25 mm/0.25 μm, Helium, 3. K/min; Tstart: 60. C; Tend: 240. C
CapillaryDB-1995.Fathi, Sahari, et al., 201130. m/0.25 mm/0.25 μm, Helium, 5. K/min; Tstart: 40. C; Tend: 210. C
CapillaryVF-5 MS1000.Leffingwell and Alford, 201160. m/0.32 mm/0.25 μm, Helium, 2. K/min, 260. C @ 28. min; Tstart: 30. C
CapillaryVF-5 MS1000.Leffingwell and Alford, 201160. m/0.32 mm/0.25 μm, Helium, 2. K/min, 260. C @ 28. min; Tstart: 30. C
CapillaryHP-5 MS994.Miyazawa, Marumoto, et al., 201130. m/0.25 mm/0.25 μm, Helium, 4. K/min, 260. C @ 5. min; Tstart: 40. C
CapillaryBP-1986.Mishra, Chaudhary, et al., 2010Nitrogen, 60. C @ 10. min, 5. K/min, 220. C @ 30. min
CapillaryHP-5 MS995.Radulovic, Blagojevic, et al., 201030. m/0.25 mm/0.25 μm, Helium, 5. K/min, 290. C @ 10. min; Tstart: 70. C
CapillaryHP-5 MS995.Radulovic, Dordevic, et al., 201030. m/0.25 mm/0.25 μm, Helium, 5. K/min, 290. C @ 10. min; Tstart: 70. C
CapillaryDB-1980.Xu, Tang, et al., 201030. m/0.25 mm/0.25 μm, Helium, 50. C @ 2. min, 4. K/min, 220. C @ 2. min
CapillaryHP-5 MS997.Kim and Chung, 200930. m/0.25 mm/0.25 μm, Helium, 35. C @ 5. min, 2. K/min, 195. C @ 30. min
CapillaryHP-5998.Maridass, 200925. m/0.20 mm/0.33 μm, Helium, 3. K/min, 240. C @ 7. min; Tstart: 60. C
CapillaryDB-51001.Porto, Decorti, et al., 200930. m/0.25 mm/0.25 μm, Helium, 45. C @ 3. min, 3. K/min, 250. C @ 5. min
CapillaryDB-5 MS1002.Su, Wang, et al., 200930. m/0.25 mm/0.25 μm, Helium, 40. C @ 2. min, 4. K/min, 250. C @ 2. min
CapillaryHP-5 MS996.Sahraoui, Vian, et al., 200830. m/0.25 mm/0.25 μm, Helium, 60. C @ 8. min, 2. K/min, 250. C @ 15. min
CapillaryHP-5 MS963.Sarikurkcu, Tepe, et al., 200830. m/0.25 mm/0.25 μm, Helium, 3. K/min; Tstart: 50. C; Tend: 240. C
CapillaryHP-5 MS995.Thakeow, Angeli, et al., 200830. m/0.25 mm/0.25 μm, Helium, 50. C @ 1.5 min, 6.5 K/min, 250. C @ 10. min
CapillaryHP-5MS993.Basta, Tzakou, et al., 200730. m/0.25 mm/0.25 μm, He, 3. K/min; Tstart: 60. C; Tend: 280. C
CapillaryDB-5990.Ghasemi, Yamini, et al., 200730. m/0.25 mm/0.25 μm, He, 60. C @ 3. min, 30. K/min; Tend: 210. C
CapillaryRTX-5 MS994.Hudaib and Aburjai, 200730. m/0.25 mm/0.25 μm, He, 3. K/min; Tstart: 45. C; Tend: 210. C
CapillaryDB-1978.Monser-Esfahani, Karamkhani, et al., 200730. m/0.25 mm/0.25 μm, Helium, 50. C @ 1. min, 2.5 K/min, 260. C @ 20. min
CapillaryHP-5 MS991.Vagionas, Graikou, et al., 200730. m/0.25 mm/0.25 μm, Helium, 3. K/min; Tstart: 60. C; Tend: 280. C
CapillaryHP-51002.Figuérédo, Cabassu, et al., 200630. m/0.25 mm/0.25 μm, He, 50. C @ 5. min, 5. K/min, 300. C @ 5. min
CapillaryBPX-5986.Fons, Rapior, et al., 200625. m/0.20 mm/0.13 μm, Helium, 50. C @ 2. min, 3. K/min; Tend: 230. C
CapillarySPB-5993.Stojanovic, Palic, et al., 2006He, 50. C @ 3. min, 5. K/min, 250. C @ 15. min
CapillaryBPX5992.Boustie, Rapior, et al., 200525. m/0.20 mm/0.13 μm, He, 50. C @ 2. min, 3. K/min; Tend: 230. C
CapillaryHP-5998.Duarte, Figueira, et al., 200525. m/0.2 mm/0.33 μm, He, 3. K/min, 240. C @ 7. min; Tstart: 60. C
CapillaryHP-51002.Figuérédo, Cabassu, et al., 200530. m/0.25 mm/0.25 μm, He, 50. C @ 5. min, 5. K/min, 300. C @ 5. min
CapillaryDB-5993.Morteza-Semnani, Akbarzadeh, et al., 200530. m/0.25 mm/0.25 μm, He, 60. C @ 5. min, 4. K/min; Tend: 220. C
CapillaryDB-1981.Nyegue, Belinga-Ndoye, et al., 200530. m/0.25 mm/0.25 μm, N2, 5. K/min; Tstart: 50. C; Tend: 200. C
CapillaryDB-51004.Özel, Gögüs, et al., 200530. m/0.32 mm/0.25 μm, He, 40. C @ 0.5 min, 5. K/min, 250. C @ 2. min
CapillarySPB-5993.Pino, Marbot, et al., 200530. m/0.25 mm/0.25 μm, He, 60. C @ 2. min, 4. K/min, 250. C @ 20. min
CapillaryDB-5992.Sefidkon and Jamzad, 2005He, 4. K/min; Column length: 30. m; Column diameter: 0.25 mm; Tstart: 40. C; Tend: 240. C
CapillaryPE-5999.Singh, Raina, et al., 200530. m/0.32 mm/0.25 μm, H2, 60. C @ 2. min, 5. K/min, 230. C @ 4. min
CapillaryDB-5991.Skoula and Grayer, 200530. m/0.25 mm/0.25 μm, He, 3. K/min, 230. C @ 20. min; Tstart: 60. C
CapillaryHP-5MS993.Slavkovska, Couladis, et al., 200530. m/0.25 mm/0.25 μm, He, 3. K/min; Tstart: 60. C; Tend: 280. C
CapillaryHP-5MS990.Tepe B., Sokmen M., et al., 200530. m/0.25 mm/0.25 μm, He, 50. C @ 3. min, 3. K/min; Tend: 240. C
CapillaryDB-5982.Tzakou and Constantinidis, 200530. m/0.32 mm/0.25 μm, He, 3. K/min; Tstart: 60. C; Tend: 280. C
CapillarySPB-1977.Wong and Tan, 200550. m/0.2 mm/0.33 μm, He, 50. C @ 3. min, 4. K/min, 220. C @ 30. min
CapillaryHP-5988.Aghel, Yamini, et al., 200430. m/0.25 mm/0.32 μm, He, 60. C @ 3. min, 5. K/min; Tend: 250. C
CapillaryDB-5991.Kalvandi, Sefidkon, et al., 200460. m/0.25 mm/0.25 μm, He, 40. C @ 4. min, 4. K/min; Tend: 280. C
CapillaryHP-5MS995.Mimica-Dukic, Bozin, et al., 200430. m/0.25 mm/0.25 μm, He, 3. K/min; Tstart: 60. C; Tend: 280. C
CapillaryNB-30986.Raal, Paaver, et al., 200450. m/0.20 mm/0.25 μm, He, 2. K/min; Tstart: 50. C; Tend: 250. C
CapillaryRSL-200979.Jirovetz, Buchbauer, et al., 200330. m/0.32 mm/0.25 μm, H2, 40. C @ 5. min, 6. K/min, 280. C @ 5. min
CapillaryDB-5981.Juteau, Jerkovic, et al., 200350. m/0.2 mm/0.25 μm, He, 50. C @ 2. min, 3. K/min, 220. C @ 10. min
CapillaryNB-30989.Raal, Arak, et al., 200350. m/0.2 mm/0.5 μm, He, 2. K/min; Tstart: 50. C; Tend: 250. C
CapillaryHP-5993.Stashenko, Jaramillo, et al., 200360. m/0.25 mm/0.25 μm, 40. C @ 15. min, 5. K/min; Tend: 250. C
CapillaryHP-5994.Stashenko, Jaramillo, et al., 200360. m/0.25 mm/0.25 μm, 40. C @ 15. min, 5. K/min; Tend: 250. C
CapillaryHP-5991.Velickovic, Randjelovic, et al., 200325. m/0.32 mm/0.53 μm, H2, 4. K/min; Tstart: 40. C; Tend: 280. C
CapillaryHP-5995.Velickovic, Randjelovic, et al., 200325. m/0.32 mm/0.53 μm, H2, 4. K/min; Tstart: 40. C; Tend: 280. C
CapillaryHP-5991.Velickovic, Ristic, et al., 200325. m/0.32 mm/0.53 μm, Helium, 4. K/min; Tstart: 40. C; Tend: 280. C
CapillaryHP-5992.Velickovic, Ristic, et al., 200325. m/0.32 mm/0.53 μm, Helium, 4. K/min; Tstart: 40. C; Tend: 280. C
CapillaryRSL-200981.Jirovetz, Smith, et al., 200230. m/0.25 mm/0.25 μm, H2, 40. C @ 2. min, 6. K/min, 280. C @ 10. min
CapillaryDB-5995.Kobaisy, Tellez, et al., 200230. m/0.25 mm/0.25 μm, He, 3. K/min; Tstart: 60. C; Tend: 240. C
CapillaryDB-5MS993.Maia, Zoghbi, et al., 200230. m/0.25 mm/0.25 μm, He, 3. K/min; Tstart: 60. C; Tend: 240. C
CapillaryDB-5MS971.Marongiu, Porcedda, et al., 200130. m/0.25 mm/0.25 μm, He, 3. K/min, 240. C @ 30. min; Tstart: 60. C
CapillaryOV-101987.Orav, Kailas, et al., 200150. m/0.2 mm/0.5 μm, He, 2. K/min; Tstart: 50. C; Tend: 250. C
CapillaryDB-5991.Maia, Zoghbi, et al., 200030. m/0.25 mm/0.25 μm, He, 3. K/min; Tstart: 60. C; Tend: 240. C
CapillaryBP-1994.Mohagheghzadeh, Shams-Ardakani, et al., 200025. m/0.33 mm/1.0 μm, N2, 4. K/min; Tstart: 60. C; Tend: 275. C
CapillaryHP-5994.Mohagheghzadeh, Shams-Ardakani, et al., 2000, 230. m/0.25 mm/0.25 μm, He, 4. K/min; Tstart: 60. C; Tend: 275. C
CapillaryDB-5995.Tellez, Dayan, et al., 200030. m/0.25 mm/0.25 μm, He, 3. K/min; Tstart: 60. C; Tend: 240. C
CapillarySE-30985.Zhou, Robards, et al., 200010. K/min, 300. C @ 4. min; Column length: 30. m; Column diameter: 0.25 mm; Tstart: 50. C
CapillaryHP-1986.Lopes, Koketsu, et al., 199925. m/0.32 mm/0.17 μm, H2, 40. C @ 5. min, 3. K/min; Tend: 260. C
CapillaryBP-1984.Rao, Bhattacharya, et al., 1999N2, 5. K/min, 220. C @ 10. min; Column length: 25. m; Column diameter: 0.5 mm; Tstart: 60. C
CapillaryOptima 1988.Fons, Rapior, et al., 199825. m/0.20 mm/0.25 μm, Helium, 3. K/min; Tstart: 50. C; Tend: 200. C
CapillaryHP-5999.Larsen and Frisvad, 199535. C @ 2. min, 6. K/min; Tend: 200. C
CapillaryDB-1980.Binder and Flath, 198950. C @ 0.1 min, 4. K/min, 250. C @ 5. min; Column length: 60. m; Column diameter: 0.32 mm
CapillaryOV-101982.Nykanen, 198640. C @ 5. min, 3.5 K/min; Column length: 50. m; Column diameter: 0.30 mm; Tend: 230. C
CapillaryOV-101983.Nykanen, 198640. C @ 5. min, 3.5 K/min; Column length: 50. m; Column diameter: 0.30 mm; Tend: 230. C
CapillaryOV-101995.Nykanen, 198640. C @ 5. min, 3.5 K/min; Column length: 50. m; Column diameter: 0.30 mm; Tend: 230. C
CapillaryOV-1993.De Pooter, De Buyck, et al., 1986He, 2. K/min; Tstart: 40. C; Tend: 220. C
CapillaryOV-101995.De Pooter and Schamp, 198630. m/0.5 mm/0.8 μm, He, 2. K/min; Tstart: 40. C; Tend: 220. C
CapillaryOV-101984.del Rosario, de Lumen, et al., 1984He, 0. C @ 1. min, 3. K/min; Column length: 50. m; Column diameter: 0.31 mm; Tend: 225. C
CapillarySE-30986.Heydanek and McGorrin, 1981He, 40. C @ 3. min, 3. K/min; Column length: 50. m; Column diameter: 0.5 mm; Tend: 170. C

Normal alkane RI, non-polar column, custom temperature program

View large format table.

Column type Active phase I Reference Comment
CapillaryDB-1974.Albano, Lima, et al., 201230. m/0.25 mm/0.25 μm, Hydrogen; Program: 45 0C 3 0C/min -> 175 0C 15 0C/min -> 300 0C (10 min)
CapillarySiloxane, 5 % Ph986.VOC BinBase, 2012Program: not specified
CapillaryHP-5996.Citron, Riclea, et al., 2011Program: not specified
CapillaryPolydimethyl siloxane, 5 % phenyl986.Skogerson, Wohlgemuth, et al., 2011Program: not specified
CapillaryDB-1995.Xu, Tang, et al., 201030. m/0.25 mm/0.25 μm, Helium; Program: not specified
CapillaryDB-51000.Courtois, Paine, et al., 200930. m/0.25 mm/0.25 μm, Helium; Program: 50 0C m6 0C/min -> 140 0C 5 0C/min -> 160 0C (1 min) 10 0C/min -> 200 0C
CapillaryHP-51000.Maggi, Bilek, et al., 200925. m/0.32 mm/0.17 μm, Helium; Program: 60 0C (5 min) 4 0C/min -> 220 0C 11 0C/min -> 280 0C
CapillaryDB-51004.Porto, Decorti, et al., 200930. m/0.25 mm/0.25 μm, Helium; Program: not specified
CapillaryDB-5 MS996.Su, Wang, et al., 200930. m/0.25 mm/0.25 μm, Helium; Program: not specified
CapillaryHP-1974.Barra, Baldovini, et al., 200750. m/0.2 mm/0.33 μm, He; Program: 40C(2min) => 2C/min => 200C => 15C/min => 250C (30min)
CapillarySPB-1981.Díaz-Maroto, Castillo, et al., 200750. m/0.25 mm/0.25 μm; Program: 70C(3min) => 4C/min => 120C => 8C/min => 250C(5min)
CapillarySPB-1981.Díaz-Maroto, Castillo, et al., 200750. m/0.25 mm/0.25 μm; Program: 70C(3min) => 4C/min => 120C => 8C/min => 250C(5min)
CapillaryHP-5993.Liolios, Laouer, et al., 2007Program: not specified
CapillaryHP-5994.Splivallo, Bossi, et al., 2007He; Program: 50C => 3C/min => 200C(10min) => 10C/min => 290C(10min)
CapillarySPB-5990.Chemat, Lucchesi, et al., 200660. m/0.32 mm/1. μm, He; Program: 60C => 1C/min => 130C => 2C/min => 200C => 4C/min => 250C (40min)
CapillarySPB-5990.Iriti, Colnaghi, et al., 200660. m/0.32 mm/1. μm, He; Program: 60C => 1C/min => 130C => 2C/min => 200C => 4C/min => 250C(40min)
CapillarySE-52991.Tognolini, Barocelli, et al., 200630. m/0.32 mm/0.15 μm, He; Program: 45C => 1C/min => 100C => 5C/min => 250C (10min)
CapillaryRTX-51012.Ádámová, Orinák, et al., 200530. m/0.25 mm/0.25 μm, N2; Program: not specified
CapillaryRTX-51012.Ádámová, Orinák, et al., 200530. m/0.25 mm/0.25 μm, N2; Program: not specified
CapillaryDB-5MS1013.Bagci and Baser, 200530. m/0.25 mm/0.25 μm; Program: 70C(2min) => 10C/min => 150C(15min) => 5C/min => 240C
CapillaryMDN-5989.Jelen and Grabarkiewicz-Szczesna, 200530. m/0.25 mm/0.25 μm; Program: not specified
CapillaryHP-5MS991.Sahin, Gulluce, et al., 200430. m/0.25 mm/0.25 μm, He; Program: 50C(3min) => 3C/min => 150C(10min) => 10C/min => 250C
CapillarySPB-5994.Begnaud, Pérès, et al., 200360. m/0.32 mm/1. μm; Program: not specified
CapillaryPolydimethyl siloxane982.Junkes, Castanho, et al., 2003Program: not specified
CapillaryAT-5993.Usai, Atzei, et al., 200360. m/0.25 mm/0.25 μm, He; Program: 50 0C 5 0C/min -> 135 0C (1 min) 5 0C/min -> 225 0C (5 min) 5 0C/min -> 260 0C
CapillaryDB-5988.Rapior, Breheret, et al., 200230. m/0.20 mm/1.0 μm; Program: not specified
CapillaryDB-5988.Rapior, Breheret, et al., 200230. m/0.20 mm/1.0 μm; Program: not specified
CapillaryPolydimethyl siloxane961.Spanier, Shahidi, et al., 2001Program: not specified
CapillaryDB-1974.da Silva, Pedro, et al., 200030. m/0.25 mm/0.25 μm, H2; Program: 40 0C 3 K/min -> 175 0C 15 K/min -> 240 0C (10 min)
CapillaryMethyl Silicone982.Estrada and Gutierrez, 1999Program: not specified
CapillaryDB-1974.Pedro, da Silva, et al., 199930. m/0.25 mm/0.25 μm, He; Program: 45C => 3C/min => 170C => 15C/min => 300C(10min)
CapillaryDB-5996.Yusuf, Begum, et al., 199830. m/0.25 mm/0.25 μm, He; Program: 60C => 3C/min => 240C => 30C/min => 300C
CapillarySE-54987.Lizárraga-Guerra, Guth, et al., 1997He; Column length: 30. m; Column diameter: 0.32 mm; Program: 35C => 40C/min => 60C (1min) => 6C/min => 250C
CapillarySE-54987.Lizárraga-Guerra, Guth, et al., 1997He; Column length: 30. m; Column diameter: 0.32 mm; Program: 35C => 40C/min => 60C (1min) => 6C/min => 250C
CapillaryDB-1974.Barroso, Figueiredo, et al., 199630. m/0.25 mm/0.25 μm, H2; Program: 45 0C 3 0C/min -> 175 0C 15 0C/min -> 240 0C (10 min)
CapillaryDB-1979.Binder and Flath, 1989Column length: 60. m; Column diameter: 0.32 mm; Program: not specified
CapillaryOV-1986.De Pooter and Schamp, 198735. m/0.50 mm/1.5 μm; Program: not specified
CapillaryOV-101971.Shibamoto, 1987Column length: 60. m; Column diameter: 0.25 mm; Program: not specified

Normal alkane RI, polar column, temperature ramp

View large format table.

Column type Active phase I Reference Comment
CapillaryAT-Wax1368.Kiss, Csoka, et al., 201160. m/0.25 mm/0.25 μm, Helium, 4. K/min; Tstart: 60. C; Tend: 280. C
CapillaryZB-Wax1408.Zawirska-Wojtasiak, Siwulski, et al., 200960. m/0.53 mm/1.0 μm, Hydrogen, 8. K/min; Tstart: 60. C; Tend: 200. C
CapillaryDB-Wax1384.Guo, Wu, et al., 200830. m/0.25 mm/0.25 μm, Helium, 60. C @ 2. min, 10. K/min, 250. C @ 10. min
CapillaryHP-Innowax1380.Thakeow, Angeli, et al., 200830. m/0.25 mm/0.25 μm, Helium, 50. C @ 1.5 min, 6.5 K/min, 250. C @ 10. min
CapillaryStabilwax1383.Cros, Vandanjon, et al., 200760. m/0.25 mm/0.25 μm, Helium, 40. C @ 5. min, 3. K/min, 240. C @ 10. min
CapillaryDB-Wax1393.Lee, Umano, et al., 200530. m/0.25 mm/0.25 μm, He, 3. K/min, 180. C @ 40. min; Tstart: 50. C
CapillarySupelcowax-101391.Wong and Tan, 200530. m/0.25 mm/0.25 μm, He, 50. C @ 3. min, 4. K/min, 220. C @ 30. min
CapillarySW-101375.Raal, Paaver, et al., 200450. m/0.20 mm/0.25 μm, He, 2. K/min; Tstart: 50. C; Tend: 230. C
CapillaryStabilwax1383.Cros, Vandanjon, et al., 2003, 260. m/0.25 mm/0.25 μm, Helium, 40. C @ 5. min, 3. K/min, 240. C @ 10. min
CapillaryHP-20M1357.Juteau, Jerkovic, et al., 200350. m/0.2 mm/0.2 μm, He, 70. C @ 4. min, 4. K/min, 180. C @ 10. min
CapillaryTC-Wax1411.Miyazawa and Okuno, 2003He, 4. K/min, 250. C @ 30. min; Column length: 60. m; Column diameter: 0.25 mm; Tstart: 80. C
CapillarySW-101395.Raal, Arak, et al., 200350. m/0.20 mm/0.25 μm, He, 2. K/min; Tstart: 50. C; Tend: 250. C
CapillaryDB-Wax1396.Fu, Yoon, et al., 200230. m/0.25 mm/0.25 μm, He, 40. C @ 5. min, 8. K/min, 250. C @ 5. min
CapillaryPEG-20M1395.Orav, Kailas, et al., 2001He, 2. K/min; Column length: 50. m; Column diameter: 0.2 mm; Tstart: 70. C; Tend: 250. C
CapillaryCarbowax 20M1364.Vernin, Lageot, et al., 200150. m/0.22 mm/0.25 μm, He, 2. K/min; Tstart: 60. C; Tend: 220. C
CapillarySupelcowax-101391.Korány, Mednyánszky, et al., 200060. m/0.25 mm/0.25 μm, He, 4. K/min; Tstart: 60. C; Tend: 280. C
CapillaryDB-Wax1379.Lee and Shibamoto, 200030. m/0.25 mm/0.25 μm, He, 3. K/min, 180. C @ 40. min; Tstart: 50. C
CapillaryDB-Wax1397.Umano, Hagi, et al., 200060. m/0.25 mm/0.25 μm, He, 40. C @ 2. min, 2. K/min; Tend: 200. C
CapillaryCP-Wax 52CB1380.Hwan and Chou, 199950. m/0.32 mm/0.22 μm, H2, 60. C @ 4. min, 2. K/min, 190. C @ 21. min
CapillaryInnowax1398.Kaya, Baser, et al., 199960. m/0.25 mm/0.25 μm, He, 60. C @ 10. min; Tend: 220. C
CapillaryHP-Innowax1398.Kaya, Baser, et al., 1999, 260. m/0.25 mm/0.25 μm, He, 60. C @ 10. min; Tend: 220. C
CapillaryHP-Innowax1398.Kaya, Baser, et al., 1999, 260. m/0.25 mm/0.25 μm, He, 60. C @ 10. min; Tend: 220. C
CapillaryHP-Innowax1398.Kaya, Baser, et al., 1999, 260. m/0.25 mm/0.25 μm, He, 60. C @ 10. min; Tend: 220. C
CapillaryDB-Wax1389.Ngassoum, Yonkeu, et al., 199960. m/0.25 mm/0.25 μm, He, 4. K/min; Tstart: 60. C; Tend: 240. C
CapillaryBP-201382.Rao, Bhattacharya, et al., 1999N2, 5. K/min; Column length: 25. m; Column diameter: 0.5 mm; Tstart: 60. C; Tend: 200. C
CapillaryTC-Wax1388.Shuichi, Masazumi, et al., 199680. C @ 5. min, 3. K/min; Column length: 60. m; Column diameter: 0.25 mm; Tend: 240. C
CapillaryDB-Wax1390.Binder and Flath, 198950. C @ 0.1 min, 4. K/min, 250. C @ 5. min; Column length: 60. m; Column diameter: 0.32 mm
CapillaryCarbowax 20M1405.Shibamoto, 19872. K/min; Column length: 50. m; Column diameter: 0.25 mm; Tstart: 80. C; Tend: 200. C
CapillaryCarbowax 20M1395.Nykanen, 198640. C @ 5. min, 2. K/min; Column length: 25. m; Column diameter: 0.30 mm; Tend: 220. C
CapillaryCarbowax 20M1400.Seifert and King, 1982He, 50. C @ 10. min, 1. K/min, 170. C @ 60. min; Column length: 150. m; Column diameter: 0.64 mm
CapillaryCarbowax 20M1390.Buttery and Kamm, 198050. C @ 30. min, 1. K/min; Column length: 150. m; Column diameter: 0.64 mm; Tend: 170. C

Normal alkane RI, polar column, custom temperature program

View large format table.

Column type Active phase I Reference Comment
CapillaryDB-Wax1399.Welke, Manfroi, et al., 201230. m/0.25 mm/0.25 μm, Helium; Program: not specified
CapillaryDB-Wax1406.Welke, Manfroi, et al., 201230. m/0.25 mm/0.25 μm, Helium; Program: not specified
CapillaryDB-Wax1411.Welke, Manfroi, et al., 201230. m/0.25 mm/0.25 μm, Helium; Program: not specified
CapillaryInnowax FSC1393.Demirci, Temel, et al., 201160. m/0.25 mm/0.25 μm, Helium; Program: 60 0C (10 min) 4 0C/min -> 220 0C (10 min) 1 0C/min -> 240 0C
CapillarySOLGel-Wax1399.Johanningsmeier and McFeeters, 201130. m/0.25 mm/0.25 μm, Helium; Program: 40 0C (2 min) 5 0C/min -> 140 0C 10 0C/min -> 250 0C (3 min)
CapillarySOLGel-Wax1395.Johanningsmeier and McFeeters, 201130. m/0.25 mm/0.25 μm, Helium; Program: not specified
CapillaryDB-Wax1399.Canuti, Conversano, et al., 200930. m/0.25 mm/0.25 μm, Helium; Program: 40 0C (4 min) 2.5 0C/min -> 80 0C 5 0C/min -> 110 0C 10 0C/min -> 220 0C (5 min)
CapillaryDB-Wax1394.Canuti, Conversano, et al., 200930. m/0.25 mm/0.25 μm, Helium; Program: not specified
CapillaryCarbowax 20M1403.Hudaib and Aburjai, 200730. m/0.25 mm/0.25 μm, He; Program: not specified
CapillaryAquaWax1394.Liolios, Laouer, et al., 2007Program: not specified
CapillaryHP-Innowax1383.Narain, Galvao, et al., 200730. m/0.25 mm/0.25 μm, Helium; Program: 30 0C (5 min) 5 0C/min -> 100 0C (5 min) 1 0C/min -> 130 0C 10 0C/min -> 195 0C (45 min)
CapillaryHP-Innowax FSC1393.Tabanca, Demirci, et al., 200660. m/0.25 mm/0.25 μm, N2; Program: 60C(10min) => 4C/min => 220C => (10min) => 1C/min => 240C
CapillaryHP-Innowax FSC1393.Demirci, Demirci, et al., 200560. m/0.25 mm/0.25 μm, N2; Program: 60C(10min) => 4C/min => 220C (10min) => 1C/min => 240C
CapillaryHP-Innowax FSC1393.Demirci, Paper, et al., 200460. m/0.25 mm/0.25 μm, He; Program: 60C(10min) => 4C/min => 220C(10min) => 1C/min => 240C
CapillaryHP-Innowax FSC1393.Demirci, Baser, et al., 200360. m/0.25 mm/0.25 μm, He; Program: 60C (10min) => 4C/min => 220C (10min) => 1C/min => 240C
CapillaryHP-Innowax FSC1393.Erdemoglu, Sener, et al., 200360. m/0.25 mm/0.25 μm, He; Program: 60C(10min) => 4C/min => 220C(10min) => 1C/min => 240C
CapillaryHP-Innowax1393.Baser, Demirci, et al., 200260. m/0.25 mm/0.25 μm, He; Program: 60 0C (10 min) 4 K/min -> 220 0C (10 min) 1 K/min -> 240 0C
CapillaryHP-Innowax FSC1393.Kaya, Demirci, et al., 200160. m/0.25 mm/0.25 μm; Program: 60C(10min) => 4C/min => 220C(10min) => 1C/min => 240C
CapillaryHP-Innowax FSC1393.Kirimer N., Tabanea N., et al., 200160. m/0.25 mm/0.25 μm, He; Program: 60C(10min) => 4C/min => 220C(10min) => 1C/min => 240C
CapillaryNukol1379.López and Dufour, 2001N2; Column length: 25. m; Column diameter: 0.25 mm; Program: 45C(5min) => 20C/min => 100C(1min) => 3C/min => 190C(40min)
CapillaryInnowax FSC1393.Tabanca N., Demirci F., et al., 200160. m/0.25 mm/0.25 μm, He; Program: 60C(10min) => 4C/min => 220C(10min) => 1C/min => 240C
CapillaryHP-Innowax FSC1393.Tabanca, Kirimer, et al., 200160. m/0.25 mm/0.25 μm; Program: 60C(10min) => 4C/min => 220C(10min) => 1C/min => 240C
CapillaryHP-Innowax1393.Tabanca, Kirimer, et al., 2001, 260. m/0.25 mm/0.25 μm, He; Program: 60C(10min) => 4C/min => 220C(10min) => 1C/min => 240C
CapillaryInnowax FSC1393.Kirimer, Tabanca, et al., 200060. m/0.25 mm/0.25 μm, He; Program: 60C(10 min) => 4C/min => 220C(10min) => 1C/min => 240C
CapillaryInnowax FSC1393.Kirimer, Tabanca, et al., 199960. m/0.25 mm/0.25 μm, Helium; Program: 60 0C (10 min) 4 0C/min -> 220 0C (10 min) 1 0C/min -> 240 0C
CapillaryDB-Wax1401.Caldentey, Daria Fumi, et al., 199830. m/0.25 mm/0.25 μm, He; Program: 25C(8min) => 4C/min => 60C => 6C/min => 160C => 20C/min => 200C
CapillaryDB-FFAP1379.Lizárraga-Guerra, Guth, et al., 1997He; Column length: 30. m; Column diameter: 0.32 mm; Program: 35C => 40C/min => 60C (1min) => 6C/min => 250C
CapillaryDB-Wax1394.Binder and Flath, 1989Column length: 60. m; Column diameter: 0.32 mm; Program: not specified

References

Cline and Andrews, 1931
Cline, J.K.; Andrews, D.H.,
Thermal energy studies. III. The octanols,
J. Am. Chem. Soc., 1931, 53, 3668-3673. [all data]
Gude and Teja, 1995
Gude, M.; Teja, A.S.,
Vapor-Liquid Critical Properties of Elements and Compounds. 4. Aliphatic Alkanols,
J. Chem. Eng. Data, 1995, 40, 1025-1036. [all data]
Teja, Lee, et al., 1989
Teja, A.S.; Lee, R.J.; Rosenthal, D.J.; Anselme, M.J.,
Correlation of the Critical Properties of Alkanes and Alkanols
in 5th IUPAC Conference on Alkanes and AlkanolsGradisca, 1989. [all data]
Anselme and Teja, 1988
Anselme, M.J.; Teja, A.S.,
Critical Temperatures and Densities of Isomeric Alkanols with Six to Ten Carbon Atoms,
Fluid Phase Equilib., 1988, 40, 127-34. [all data]
Geiseler, Fruwert, et al., 1966
Geiseler, Gerhard; Fruwert, Johanna; Hüttig, Rainer,
Dampfdruck- und Schwingungsverhalten der stellungsisomeren n-Octanole und hydroxydeuterierten n-Octanole,
Chem. Ber., 1966, 99, 5, 1594-1601, https://doi.org/10.1002/cber.19660990525
. [all data]