Hexane, 2,4-dimethyl-
- Formula: C8H18
- Molecular weight: 114.2285
- IUPAC Standard InChIKey: HDGQICNBXPAKLR-UHFFFAOYSA-N
- CAS Registry Number: 589-43-5
- Chemical structure:
View 3d structure (requires JavaScript / HTML 5) - Species with the same structure:
- Stereoisomers:
- Other names: 2,4-Dimethylhexane

Gas phase thermochemistry data

Data compiled by: Hussein Y. Afeefy, Joel F. Liebman, and Stephen E. Stein
Quantity | Value | Units | Method | Reference | Comment |
---|---|---|---|---|---|
ΔfH°gas | -52.44 ± 0.27 | kcal/mol | Ccb | Prosen and Rossini, 1945 |

Condensed phase thermochemistry data

Data compiled by: Hussein Y. Afeefy, Joel F. Liebman, and Stephen E. Stein
Quantity | Value | Units | Method | Reference | Comment |
---|---|---|---|---|---|
ΔfH°liquid | -61.47 ± 0.27 | kcal/mol | Ccb | Prosen and Rossini, 1945 | |
Quantity | Value | Units | Method | Reference | Comment |
ΔcH°liquid | -1305.80 ± 0.24 | kcal/mol | Ccb | Prosen and Rossini, 1945 | Corresponding ΔfHºliquid = -61.44 kcal/mol (simple calculation by NIST; no Washburn corrections) |
ΔcH°liquid | -1258.7 | kcal/mol | Ccb | Richards and Jesse, 1910 | At 293 K; Corresponding ΔfHºliquid = -108.6 kcal/mol (simple calculation by NIST; no Washburn corrections) |

Phase change data

Data compiled as indicated in comments:
TRC - Thermodynamics Research Center, NIST Boulder Laboratories, Chris Muzny director
AC - William E. Acree, Jr., James S. Chickos
ALS - Hussein Y. Afeefy, Joel F. Liebman, and Stephen E. Stein
Quantity | Value | Units | Method | Reference | Comment |
---|---|---|---|---|---|
Tboil | 382. ± 2. | K | AVG | N/A | Average of 22 values; Individual data points |
Quantity | Value | Units | Method | Reference | Comment |
Tc | 553.5 ± 0.5 | K | N/A | Daubert, 1996 | |
Tc | 553.45 | K | N/A | McMicking and Kay, 1965 | Uncertainty assigned by TRC = 0.4 K; TRC |
Tc | 550.0 | K | N/A | Young and Fortey, 1879 | Uncertainty assigned by TRC = 1. K; TRC |
Quantity | Value | Units | Method | Reference | Comment |
Pc | 25.3 ± 0.4 | atm | N/A | Daubert, 1996 | |
Pc | 25.229 | atm | N/A | McMicking and Kay, 1965 | Uncertainty assigned by TRC = 0.4000 atm; TRC |
Pc | 24.553 | atm | N/A | Young and Fortey, 1879 | Uncertainty assigned by TRC = 0.074 atm; from obs. vapor pressure at Tc; TRC |
Quantity | Value | Units | Method | Reference | Comment |
Vc | 0.472 | l/mol | N/A | Daubert, 1996 | |
Quantity | Value | Units | Method | Reference | Comment |
ρc | 2.12 ± 0.04 | mol/l | N/A | Daubert, 1996 | |
ρc | 2.12 | mol/l | N/A | McMicking and Kay, 1965 | Uncertainty assigned by TRC = 0.04 mol/l; ~; TRC |
Quantity | Value | Units | Method | Reference | Comment |
ΔvapH° | 9.042 | kcal/mol | N/A | Majer and Svoboda, 1985 | |
ΔvapH° | 9.03 | kcal/mol | N/A | Reid, 1972 | AC |
ΔvapH° | 9.03 ± 0.02 | kcal/mol | C | Osborne and Ginnings, 1947 | AC |
ΔvapH° | 9.025 | kcal/mol | C | Osborne and Ginnings, 1947, 2 | ALS |
Enthalpy of vaporization
ΔvapH (kcal/mol) | Temperature (K) | Method | Reference | Comment |
---|---|---|---|---|
7.770 | 382.6 | N/A | Majer and Svoboda, 1985 | |
8.82 | 320. | A,MM | Stephenson and Malanowski, 1987 | Based on data from 305. to 385. K. See also Willingham, Taylor, et al., 1945.; AC |
9.8 | 261. | N/A | Stull, 1947 | Based on data from 246. to 382. K.; AC |
Antoine Equation Parameters
log10(P) = A − (B / (T + C))
P = vapor pressure (atm)
T = temperature (K)
View plot Requires a JavaScript / HTML 5 canvas capable browser.
Temperature (K) | A | B | C | Reference | Comment |
---|---|---|---|---|---|
246.3 to 382.6 | 3.98283 | 1292.707 | -57.97 | Stull, 1947 | Coefficents calculated by NIST from author's data. |

Reaction thermochemistry data

Data compiled by: Hussein Y. Afeefy, Joel F. Liebman, and Stephen E. Stein
Individual Reactions
By formula: C8H18 = C8H18
Quantity | Value | Units | Method | Reference | Comment |
---|---|---|---|---|---|
ΔrH° | -1.73 ± 0.18 | kcal/mol | Ciso | Prosen and Rossini, 1945, 2 | liquid phase; Calculated from ΔHc |

Kovats' RI, non-polar column, isothermal

Column type | Active phase | Temperature (C) | I | Reference | Comment |
---|---|---|---|---|---|
Capillary | OV-101 | 40. | 732.2 | Chen, Liang, et al., 2001 | He; Column length: 50. m; Column diameter: 0.25 mm |
Capillary | OV-101 | 60. | 733.3 | Chen, Liang, et al., 2001 | He; Column length: 50. m; Column diameter: 0.25 mm |
Packed | C78, Branched paraffin | 130. | 733.5 | Dallos, Sisak, et al., 2000 | He; Column length: 3.3 m |
Capillary | OV-101 | 0. | 731. | Skrbic, 1997 | |
Capillary | OV-101 | 0. | 732. | Skrbic, 1997 | |
Packed | Squalane | 78.5 | 735.1 | Zhang and Lu, 1996 | |
Capillary | Squalane | 25. | 731. | Hilal, Carreira, et al., 1994 | |
Capillary | DB-1 | 60. | 734.9 | Krupcik, Skacani, et al., 1994 | H2; Phase thickness: 0.25 μm |
Capillary | PONA | 60. | 734.8 | Krupcik, Skacani, et al., 1994 | H2; Phase thickness: 0.5 μm |
Capillary | PONA | 60. | 734.9 | Krupcik, Skacani, et al., 1994 | H2; Phase thickness: 0.5 μm |
Capillary | DB-1 | 60. | 734.9 | Krupcik, Skacani, et al., 1994 | H2; Phase thickness: 1. μm |
Capillary | OV-101 | 60. | 734.8 | Krupcik, Skacani, et al., 1994 | H2; Phase thickness: 0.2 μm |
Packed | C78, Branched paraffin | 130. | 732.9 | Reddy, Dutoit, et al., 1992 | Chromosorb G HP; Column length: 3.3 m |
Capillary | BP-1 | 0. | 732. | Skrbic and Cvejanov, 1992 | 15. m/0.53 mm/1.0 μm, N2 |
Packed | Apolane | 130. | 733. | Dutoit, 1991 | Column length: 3.7 m |
Capillary | OV-1 | 60. | 735. | Engewald, Maurer, et al., 1989 | |
Capillary | Squalane | 50. | 731.9 | Guan, Kiraly, et al., 1989 | 50. m/0.22 mm/0.21 μm, He |
Capillary | Squalane | 70. | 732.9 | Guan, Kiraly, et al., 1989 | 50. m/0.22 mm/0.21 μm, He |
Capillary | OV-101 | 40. | 734. | Laub and Purnell, 1988 | |
Capillary | OV-101 | 60. | 735. | Laub and Purnell, 1988 | |
Capillary | OV-101 | 80. | 736. | Laub and Purnell, 1988 | |
Capillary | Squalane | 50. | 731.3 | Lunskii and Paizanskaya, 1988 | He; Column length: 50. m; Column diameter: 0.22 mm |
Capillary | Squalane | 70. | 732.6 | Lunskii and Paizanskaya, 1988 | He; Column length: 50. m; Column diameter: 0.22 mm |
Capillary | Nonpolar | 45. | 732. | Stoyanov and Dimov, 1987 | |
Capillary | Nonpolar | 52.5 | 732. | Stoyanov and Dimov, 1987 | |
Capillary | Nonpolar | 60. | 733. | Stoyanov and Dimov, 1987 | |
Capillary | OV-101 | 40. | 733.4 | Boneva and Dimov, 1986 | 100. m/0.27 mm/0.9 μm |
Capillary | OV-101 | 50. | 734.0 | Boneva and Dimov, 1986 | 100. m/0.27 mm/0.9 μm |
Capillary | OV-101 | 60. | 734.7 | Boneva and Dimov, 1986 | 100. m/0.27 mm/0.9 μm |
Capillary | OV-101 | 70. | 735.4 | Boneva and Dimov, 1986 | 100. m/0.27 mm/0.9 μm |
Capillary | OV-101 | 30. | 733. | Chien, Furio, et al., 1983 | |
Capillary | OV-101 | 40. | 734. | Chien, Furio, et al., 1983 | |
Capillary | OV-101 | 50. | 734. | Chien, Furio, et al., 1983 | |
Capillary | OV-101 | 60. | 735. | Chien, Furio, et al., 1983 | |
Capillary | OV-101 | 70. | 735. | Chien, Furio, et al., 1983 | |
Capillary | OV-101 | 80. | 736. | Chien, Furio, et al., 1983 | |
Capillary | DB-1 | 60. | 734.9 | Lubeck and Sutton, 1983 | Column length: 60. m; Column diameter: 0.264 mm |
Capillary | DB-1 | 60. | 734.9 | Lubeck and Sutton, 1983 | 60. m/0.259 mm/1. μm |
Capillary | OV-101 | 50. | 734. | Johansen and Ettre, 1982 | 100. m/0.27 mm/0.20 μm |
Capillary | OV-101 | 50. | 734. | Johansen and Ettre, 1982 | 55. m/0.27 mm/0.9 μm |
Capillary | SF-96 | 50. | 734. | Johansen and Ettre, 1982 | 91.4 m/0.31 mm/0.20 μm |
Capillary | OV-1 | 60. | 725. | Nijs and Jacobs, 1981 | He; Column length: 150. m; Column diameter: 0.50 mm |
Capillary | Squalane | 50. | 732.5 | Bajus, Veselý, et al., 1979 | Column length: 100. m; Column diameter: 0.25 mm |
Capillary | Squalane | 70. | 733.5 | Bajus, Veselý, et al., 1979 | Column length: 100. m; Column diameter: 0.25 mm |
Packed | Triacontane | 80. | 732. | Castello and D'Amato, 1979 | He, Chromosorb W AW (60-80 mesh); Column length: 3. m |
Packed | Squalane | 80. | 733. | Castello and D'Amato, 1979 | He, Chromosorb W AW (60-80 mesh); Column length: 3. m |
Packed | SE-30 | 80. | 736. | Dimov and Papazova, 1979 | Chromosorb W AW DMCS (80-100 mesh); Column length: 4. m |
Capillary | Squalane | 60. | 732. | Chretien and Dubois, 1976 | |
Capillary | Squalane | 100. | 730.2 | Lulova, Leont'eva, et al., 1976 | He; Column length: 120. m; Column diameter: 0.25 mm |
Packed | Apolane | 70. | 729.6 | Riedo, Fritz, et al., 1976 | He, Chromosorb; Column length: 2.4 m |
Capillary | Squalane | 100. | 736. | Mitra, Mohan, et al., 1974 | H2; Column length: 50. m; Column diameter: 0.2 mm |
Capillary | Squalane | 50. | 732. | Rijks and Cramers, 1974 | N2; Column length: 100. m; Column diameter: 0.25 mm |
Capillary | Squalane | 70. | 733. | Rijks and Cramers, 1974 | N2; Column length: 100. m; Column diameter: 0.25 mm |
Packed | SF-96 | 100. | 737.36 | Castello, Berg, et al., 1973 | Chromosorb P(DMCS); Column length: 4. m |
Packed | SF-96 | 110. | 738.19 | Castello, Berg, et al., 1973 | Chromosorb P(DMCS); Column length: 4. m |
Packed | SF-96 | 120. | 738.9 | Castello, Berg, et al., 1973 | Chromosorb P(DMCS); Column length: 4. m |
Packed | SF-96 | 80. | 736.07 | Castello, Berg, et al., 1973 | Chromosorb P(DMCS); Column length: 4. m |
Packed | SF-96 | 90. | 736.54 | Castello, Berg, et al., 1973 | Chromosorb P(DMCS); Column length: 4. m |
Capillary | OV-101 | 50. | 734. | Pacáková, Hoch, et al., 1973 | 25. m/0.25 mm/1.39 μm, N2 |
Capillary | OV-101 | 60. | 735. | Pacáková, Hoch, et al., 1973 | 25. m/0.25 mm/1.39 μm, N2 |
Capillary | Vacuum Grease Oil (VM-4) | 35. | 728. | Sidorov, Petrova, et al., 1972 | |
Capillary | Vacuum Grease Oil (VM-4) | 45. | 729. | Sidorov, Petrova, et al., 1972 | |
Capillary | Vacuum Grease Oil (VM-4) | 50. | 729. | Sidorov, Petrova, et al., 1972 | |
Capillary | Vacuum Grease Oil (VM-4) | 58. | 730. | Sidorov, Petrova, et al., 1972 | |
Capillary | Vacuum Grease Oil (VM-4) | 68. | 730. | Sidorov, Petrova, et al., 1972 | |
Capillary | Squalane | 70. | 732.1 | Dimov and Schopov, 1971 | Column length: 100. m; Column diameter: 0.25 mm |
Packed | SE-30 | 80. | 731. | Mitra and Saha, 1970 | N2 |
Packed | Squalane | 25. | 731. | Mitra and Saha, 1970 | N2 |
Packed | Squalane | 80. | 734. | Mitra and Saha, 1970 | N2 |
Capillary | Squalane | 40. | 731. | Matukuma, 1969 | N2; Column length: 91.4 m; Column diameter: 0.25 mm |
Packed | Squalane | 27. | 731. | Hively and Hinton, 1968 | He, Chromosorb P; Column length: 15. m; Column diameter: 0.25 mm |
Packed | Squalane | 49. | 732. | Hively and Hinton, 1968 | He, Chromosorb P; Column length: 15. m; Column diameter: 0.25 mm |
Packed | Squalane | 67. | 733. | Hively and Hinton, 1968 | He, Chromosorb P; Column length: 15. m; Column diameter: 0.25 mm |
Packed | Squalane | 86. | 734. | Hively and Hinton, 1968 | He, Chromosorb P; Column length: 15. m; Column diameter: 0.25 mm |
Packed | Squalane | 30. | 731.5 | Tourres, 1967 | H2; Column length: 10. m |
Packed | Squalane | 50. | 732.5 | Tourres, 1967 | H2; Column length: 10. m |
Capillary | Squalane | 30. | 731. | Tourres, 1967, 2 | H2; Column length: 100. m; Column diameter: 0.25 mm |
Capillary | Squalane | 50. | 732. | Tourres, 1967, 2 | H2; Column length: 100. m; Column diameter: 0.25 mm |
Capillary | Squalane | 70. | 733. | Tourres, 1967, 2 | H2; Column length: 100. m; Column diameter: 0.25 mm |
Packed | Squalane | 22. | 731. | Evans, 1966 | Untreated celite; Column length: 1.8 m |
Packed | Squalane | 40. | 732. | Evans, 1966 | Untreated celite; Column length: 1.8 m |
Packed | Squalane | 55. | 733. | Evans, 1966 | Untreated celite; Column length: 1.8 m |
Packed | Squalane | 70. | 734. | Evans, 1966 | Untreated celite; Column length: 1.8 m |

Kovats' RI, non-polar column, temperature ramp

Column type | Active phase | I | Reference | Comment |
---|---|---|---|---|
Capillary | DB-5 | 736. | Ramarathnam, Rubin, et al., 1993 | He, 30. C @ 2. min, 10. K/min, 280. C @ 3. min; Column length: 30. m; Column diameter: 0.13 mm |
Capillary | SE-54 | 729. | Rembold, Wallner, et al., 1989 | 30. m/0.25 mm/0.25 μm, He, 0. C @ 12. min, 12. K/min; Tend: 250. C |
Capillary | OV-101 | 728. | Hayes and Pitzer, 1982 | 110. m/0.25 mm/0.20 μm, He, 1. K/min; Tstart: 35. C; Tend: 200. C |
Capillary | Apiezon L | 726. | Louis, 1971 | N2, 1. K/min; Column length: 50. m; Column diameter: 0.25 mm; Tstart: 60. C |

Kovats' RI, non-polar column, custom temperature program

Column type | Active phase | I | Reference | Comment |
---|---|---|---|---|
Capillary | Petrocol DH-100 | 731.8 | Haagen-Smit Laboratory, 1997 | He; Column length: 100. m; Column diameter: 0.2 mm; Program: 5C(10min) => 5C/min => 50C(48min) => 1.5C/min => 195C(91min) |
Capillary | DB-1 | 736. | Hoekman, 1993 | 60. m/0.32 mm/1.0 μm, He; Program: -40 C for 12 min; -40 - 125 C at 3 deg.min; 125-185 C at 6 deg/min; 185 - 220 C at 20 deg/min; hold 220 C for 2 min |

Van Den Dool and Kratz RI, non-polar column, temperature ramp

Column type | Active phase | I | Reference | Comment |
---|---|---|---|---|
Capillary | Petrocol DH | 734.4 | Censullo, Jones, et al., 2003 | 50. m/0.25 mm/0.5 μm, He, 35. C @ 10. min, 3. K/min, 200. C @ 10. min |
Capillary | SPB-1 | 729.27 | LECO Corporation, 2003 | 30. m/0.25 mm/0.25 μm, 40. C @ 2. min, 10. K/min, 250. C @ 2. min |
Capillary | SPB-1 | 728.84 | LECO Corporation, 2003 | 30. m/0.25 mm/0.25 μm, 40. C @ 2. min, 10. K/min, 250. C @ 2. min |
Capillary | DB-5 | 729.2 | Xu, van Stee, et al., 2003 | 30. m/0.25 mm/1. μm, He, 2.5 K/min; Tstart: 50. C; Tend: 200. C |
Capillary | OV-101 | 731.7 | Yin, Liu, et al., 2001 | N2, 1. K/min; Column length: 80. m; Column diameter: 0.22 mm; Tstart: 30. C; Tend: 130. C |
Capillary | Petrocol DH | 729.78 | Subramaniam, Bochniak, et al., 1994 | 100. m/0.25 mm/0.5 μm, He, 1. K/min; Tstart: 30. C; Tend: 220. C |
Capillary | Petrocol DH | 729.87 | Subramaniam, Bochniak, et al., 1994 | 100. m/0.25 mm/0.5 μm, He, 1. K/min; Tstart: 30. C; Tend: 220. C |
Capillary | Petrocol DH | 731. | White, Hackett, et al., 1992 | 100. m/0.25 mm/0.5 μm, He, 1. K/min; Tstart: 30. C; Tend: 220. C |
Capillary | OV-101 | 728. | Hayes and Pitzer, 1981 | 108. m/0.25 mm/0.2 μm, 1. K/min; Tstart: 35. C; Tend: 200. C |

Van Den Dool and Kratz RI, non-polar column, custom temperature program

Column type | Active phase | I | Reference | Comment |
---|---|---|---|---|
Capillary | Methyl Silicone | 738.65 | Hassoun, Pilling, et al., 1999 | 50. m/0.25 mm/1. μm, He; Program: -50C(2min) => 49.9C/min => 35C(10min) => 3C/min => 200C(2min) => 40C/min => 240C(30min) |
Capillary | OV-101 | 732. | Wu and Lu, 1984 | Program: not specified |

Normal alkane RI, non-polar column, isothermal

Column type | Active phase | Temperature (C) | I | Reference | Comment |
---|---|---|---|---|---|
Capillary | OV-101 | 40. | 733. | Li and Deng, 1998 | N2; Column length: 51. m; Column diameter: 0.25 mm |
Capillary | Methyl Silicone | 50. | 732. | N/A | N2; Column length: 74.6 m; Column diameter: 0.28 mm |
Capillary | OV-101 | 50. | 734. | Wu and Lu, 1984, 2 | |
Capillary | OV-101 | 70. | 735. | Wu and Lu, 1984, 2 | |
Capillary | Squalane | 100. | 734. | Dimov N., 1976 | |
Capillary | Squalane | 70. | 733. | Dimov N., 1976 | |
Capillary | Squalane | 86. | 726. | Vigdergauz and Martynov, 1971 | He; Column length: 150. m; Column diameter: 0.35 mm |
Capillary | Squalane | 70. | 733. | Schomburg, 1966 |

Normal alkane RI, non-polar column, temperature ramp

Column type | Active phase | I | Reference | Comment |
---|---|---|---|---|
Capillary | Polydimethyl siloxane: CP-Sil 5 CB | 735. | Bramston-Cook, 2013 | 60. m/0.25 mm/1.0 μm, Helium, 45. C @ 1.45 min, 3.6 K/min, 210. C @ 2.72 min |
Capillary | Petrocol DH | 734. | Supelco, 2012 | 100. m/0.25 mm/0.50 μm, Helium, 20. C @ 15. min, 15. K/min, 220. C @ 30. min |
Capillary | PONA | 734. | Zhang, Ding, et al., 2009 | 50. m/0.20 mm/0.50 μm, Nitrogen, 35. C @ 15. min, 2. K/min, 200. C @ 10. min |
Capillary | BP-1 | 735. | Health Safety Executive, 2000 | 50. m/0.22 mm/0.75 μm, He, 5. K/min; Tstart: 50. C; Tend: 200. C |
Capillary | OV-101 | 732. | Orav, Kailas, et al., 1999 | 50. m/0.20 mm/0.50 μm, Helium, 30. C @ 6. min, 1. K/min; Tend: 100. C |
Capillary | DB-1 | 735. | Ciccioli, Cecinato, et al., 1992 | 60. m/0.32 mm/1.2 μm, He, 30. C @ 10. min, 3. K/min; Tend: 240. C |

Normal alkane RI, non-polar column, custom temperature program

Column type | Active phase | I | Reference | Comment |
---|---|---|---|---|
Capillary | Methyl Silicone | 734. | Chen and Feng, 2007 | Program: not specified |
Capillary | Methyl Silicone | 732. | Feng and Mu, 2007 | Program: not specified |
Capillary | Methyl Silicone | 736. | Blunden, Aneja, et al., 2005 | 60. m/0.32 mm/1.0 μm, Helium; Program: -50 0C (2 min) 8 0C/min -> 200 0C (7.75 min) 25 0C -> 225 0C (8 min) |
Capillary | OV-101 | 733. | Du and Liang, 2003 | Program: not specified |
Capillary | Polydimethyl siloxanes | 732. | Yin, Guo, et al., 2001 | Program: not specified |
Capillary | Methyl Silicone | 731. | Spieksma, 1999 | Program: not specified |
Capillary | SE-54 | 733. | Zhu and He, 1999 | Program: not specified |
Capillary | SE-54 | 734. | Zhu and He, 1999 | Program: not specified |
Capillary | Methyl Silicone | 734. | Xu, Chu, et al., 1995 | Program: not specified |
Capillary | DB-1 | 732. | Ciccioli, Cecinato, et al., 1994 | 60. m/0.32 mm/0.25 μm; Program: not specified |
Capillary | OV-101 | 731. | Skrbic and Cvejanov, 1993 | Program: not specified |
Capillary | Squalane | 724. | Petrov, 1984 | Program: not specified |
Capillary | OV-1, SE-30, Methyl silicone, SP-2100, OV-101, DB-1, etc. | 728. | Waggott and Davies, 1984 | Hydrogen; Column length: 50. m; Column diameter: 0.32 mm; Program: not specified |
Capillary | OV-1, SE-30, Methyl silicone, SP-2100, OV-101, DB-1, etc. | 734. | Waggott and Davies, 1984 | Hydrogen; Column length: 50. m; Column diameter: 0.32 mm; Program: not specified |

Henry's Law data

Data compiled by: Rolf Sander

Henry's Law constant (water solution)

kH(T) = H exp(d(ln(kH))/d(1/T) ((1/T) - 1/(298.15 K)))
H = Henry's law constant for solubility in water at 298.15 K (mol/(kg*bar))
d(ln(kH))/d(1/T) = Temperature dependence constant (K)

H (mol/(kg*bar)) d(ln(kH))/d(1/T) (K) Method Reference Comment
0.00028 QN/A missing citation give several references for the Henry's law constants but don't assign them to specific species.

References

Prosen and Rossini, 1945
Prosen, E.J.; Rossini, F.D.,
Heats of combustion and formation of the paraffin hydrocarbons at 25° C,
J. Res. NBS, 1945, 263-267. [all data]
Richards and Jesse, 1910
Richards, T.W.; Jesse, R.H., Jr.,
The heats of combustion of the octanes and xylenes,
J. Am. Chem. Soc., 1910, 32, 268-298. [all data]
Daubert, 1996
Daubert, T.E.,
Vapor-Liquid Critical Properties of Elements and Compounds. 5. Branched Alkanes and Cycloalkanes,
J. Chem. Eng. Data, 1996, 41, 365-372. [all data]
McMicking and Kay, 1965
McMicking, J.H.; Kay, W.B.,
Vapor Pressures and Saturated Liquid and Vapor Densities of The Isomeric Heptanes and Isomeric Octanes,
Proc., Am. Pet. Inst., Sect. 3, 1965, 45, 75-90. [all data]
Young and Fortey, 1879
Young, S.; Fortey, E.C.,
Vapor Pressures, Specific Volumes, and Critical Constants of Diisopropyl and Diisobutyl,
J. Chem. Soc., 1879, 35, 1126-44. [all data]
Majer and Svoboda, 1985
Majer, V.; Svoboda, V.,
Enthalpies of Vaporization of Organic Compounds: A Critical Review and Data Compilation, Blackwell Scientific Publications, Oxford, 1985, 300. [all data]
Reid, 1972
Reid, Robert C.,
Handbook on vapor pressure and heats of vaporization of hydrocarbons and related compounds, R. C. Wilhort and B. J. Zwolinski, Texas A Research Foundation. College Station, Texas(1971). 329 pages.$10.00,
AIChE J., 1972, 18, 6, 1278-1278, https://doi.org/10.1002/aic.690180637
. [all data]
Osborne and Ginnings, 1947
Osborne, Nathan S.; Ginnings, Defoe C.,
Measurements of heat of vaporization and heat capacity of a number of hydrocarbons,
J. RES. NATL. BUR. STAN., 1947, 39, 5, 453-17, https://doi.org/10.6028/jres.039.031
. [all data]
Osborne and Ginnings, 1947, 2
Osborne, N.S.; Ginnings, D.C.,
Measurements of heat of vaporization and heat capacity of a number of hydrocarbons,
J. Res. NBS, 1947, 39, 453-477. [all data]
Stephenson and Malanowski, 1987
Stephenson, Richard M.; Malanowski, Stanislaw,
Handbook of the Thermodynamics of Organic Compounds, 1987, https://doi.org/10.1007/978-94-009-3173-2
. [all data]
Willingham, Taylor, et al., 1945
Willingham, C.B.; Taylor, W.J.; Pignocco, J.M.; Rossini, F.D.,
Vapor pressures and boiling points of some paraffin, alkylcyclopentane, alkylcyclohexane, and alkylbenzene hydrocarbons,
J. RES. NATL. BUR. STAN., 1945, 35, 3, 219-17, https://doi.org/10.6028/jres.035.009
. [all data]
Stull, 1947
Stull, Daniel R.,
Vapor Pressure of Pure Substances. Organic and Inorganic Compounds,
Ind. Eng. Chem., 1947, 39, 4, 517-540, https://doi.org/10.1021/ie50448a022
. [all data]
Prosen and Rossini, 1945, 2
Prosen, E.J.; Rossini, F.D.,
Heats of isomerization of the 18 octanes,
J. Res. NBS, 1945, 34, 163-174. [all data]
Chen, Liang, et al., 2001
Chen, J.P.; Liang, X.M.; Zhang, Q.; Zhang, L.F.,
Prediction of GC retention values under various column temperature conditions from temperature programmed data,
Chromatographia, 2001, 53, 9/10, 539-547, https://doi.org/10.1007/BF02491619
. [all data]
Dallos, Sisak, et al., 2000
Dallos, A.; Sisak, A.; Kulcsár, Z.; Kováts, E.,
Pair-wise interactions by gas chromatography VII. Interaction free enthalpies of solutes with secondary alcohol groups,
J. Chromatogr. A, 2000, 904, 2, 211-242, https://doi.org/10.1016/S0021-9673(00)00908-0
. [all data]
Skrbic, 1997
Skrbic, B.D.,
Unified retention concept -- statistical treatment of Kováts retention index,
J. Chromatogr. A, 1997, 764, 2, 257-264, https://doi.org/10.1016/S0021-9673(96)00955-7
. [all data]
Zhang and Lu, 1996
Zhang, X.; Lu, P.,
Unified equation between Kováts indices on different stationary phases for select types of compounds,
J. Chromatogr. A, 1996, 731, 1-2, 187-199, https://doi.org/10.1016/0021-9673(95)01213-3
. [all data]
Hilal, Carreira, et al., 1994
Hilal, S.H.; Carreira, L.A.; Karickhoff, S.W.; Melton, C.M.,
Estimation of Gas-Liquid Chromatographic Retention Times from Molecular Structure,
J. Chromatogr. A, 1994, 662, 2, 269-280, https://doi.org/10.1016/0021-9673(94)80515-6
. [all data]
Krupcik, Skacani, et al., 1994
Krupcik, J.; Skacani, I.; Benicka, E.; Sandra, P.,
Dependence of gas chromatographic retention data of hydrocarbons on the film thickness of the polydimethylsiloxane stationary phase,
Collect. Czech. Chem. Commun., 1994, 59, 11, 2390-2396, https://doi.org/10.1135/cccc19942390
. [all data]
Reddy, Dutoit, et al., 1992
Reddy, K.S.; Dutoit, J.-Cl.; Kovats, E. sz.,
Pair-wise interactions by gas chromatography. I. Interaction free enthalpies of solutes with non-associated primary alcohol groups,
J. Chromatogr., 1992, 609, 1-2, 229-259, https://doi.org/10.1016/0021-9673(92)80167-S
. [all data]
Skrbic and Cvejanov, 1992
Skrbic, B.D.; Cvejanov, J.Dj.,
Unified retention indices of hydrocarbons on BP-1 dimethylsiloxane stationary phase,
Chromatographia, 1992, 34, 1/2, 83-84, https://doi.org/10.1007/BF02290465
. [all data]
Dutoit, 1991
Dutoit, J.,
Gas chromatographic retention behaviour of some solutes on structurally similar polar and non-polar stationary phases,
J. Chromatogr., 1991, 555, 1-2, 191-204, https://doi.org/10.1016/S0021-9673(01)87179-X
. [all data]
Engewald, Maurer, et al., 1989
Engewald, W.; Maurer, T.; Schiefke, A.,
Investigation of isomeric hydrocarbons by gas-solid chromatography on graphitized thermal carbon black,
Pure Appl. Chem., 1989, 61, 11, 2001-2004, https://doi.org/10.1351/pac198961112001
. [all data]
Guan, Kiraly, et al., 1989
Guan, Y.; Kiraly, J.; Rijks, J.A.,
Interactive retention index database for compound identification in temperature-programmed capillary gas chromatography,
J. Chromatogr., 1989, 472, 129-143, https://doi.org/10.1016/S0021-9673(00)94101-3
. [all data]
Laub and Purnell, 1988
Laub, R.J.; Purnell, J.H.,
Specific retention volumes, retention indices, and family-plot regressions of aliphatic, alicyclic, and aromatic hydrocarbon solutes with OV-101 poly (dimethylsiloxane) stationary phase,
J. Hi. Res. Chromatogr. Chromatogr. Comm., 1988, 11, 9, 649-660, https://doi.org/10.1002/jhrc.1240110908
. [all data]
Lunskii and Paizanskaya, 1988
Lunskii, M.Kh.; Paizanskaya, I.L.,
Identification of hydrocarbons C1-C9 of petrol fractions of oils and condensates in the use of capillary columns with dinonylphthalate,
Zh. Anal. Khim., 1988, 43, 127-135. [all data]
Stoyanov and Dimov, 1987
Stoyanov, E.; Dimov, N.,
Precalculation of the optimum column temperature for gas chromatographic separation of petroleum fractions,
Anal. Chim. Acta., 1987, 201, 207-216, https://doi.org/10.1016/S0003-2670(00)85338-6
. [all data]
Boneva and Dimov, 1986
Boneva, S.; Dimov, N.,
Unified retention index of hydrocarbons separated on dimethylsilicone OV-101,
Chromatographia, 1986, 21, 12, 697-700, https://doi.org/10.1007/BF02313682
. [all data]
Chien, Furio, et al., 1983
Chien, C.-F.; Furio, D.L.; Kopecni, M.M.; Laub, R.J.,
Specific Retention Volumes and Retention Indices of Selected Hydrocarbon Solutes with OV-101 and SP-2100 Polydimethylsiloxane Solvents,
J. Hi. Res. Chromatogr. Chromatogr. Comm., 1983, 6, 10, 577-580, https://doi.org/10.1002/jhrc.1240061013
. [all data]
Lubeck and Sutton, 1983
Lubeck, A.J.; Sutton, DL.,
Kovats retention indices of selected hydrocarbons through C10 on bonded phase fused silica capillaries,
J. Hi. Res. Chromatogr. Chromatogr. Comm., 1983, 6, 6, 328-332, https://doi.org/10.1002/jhrc.1240060612
. [all data]
Johansen and Ettre, 1982
Johansen, N.G.; Ettre, L.S.,
Retention index values of hydrocarbons on open-tubular columns coated with methylsilicone liquid phases,
Chromatographia, 1982, 15, 10, 625-630, https://doi.org/10.1007/BF02279488
. [all data]
Nijs and Jacobs, 1981
Nijs, H.H.; Jacobs, P.A.,
On-Line Single Run Analysis of Effluents from a Fischer-Tropsch Reactor,
J. Chromatogr. Sci., 1981, 19, 1, 40-45, https://doi.org/10.1093/chromsci/19.1.40
. [all data]
Bajus, Veselý, et al., 1979
Bajus, M.; Veselý, V.; Leclercq, P.A.; Rijks, J.A.,
Steam cracking of hydrocarbons. 1. Pyrolysis of heptane,
Ind. Eng. Chem. Prod. Res. Dev., 1979, 18, 1, 30-37, https://doi.org/10.1021/i360069a007
. [all data]
Castello and D'Amato, 1979
Castello, G.; D'Amato, G.,
Use of Linear and Branched-Chain Paraffinic Liquid Phases as Non-Polar Reference Materials in Gas Chromatography,
J. Chromatogr., 1979, 175, 1, 27-35, https://doi.org/10.1016/S0021-9673(00)86400-6
. [all data]
Dimov and Papazova, 1979
Dimov, N.; Papazova, D.,
Calculation of retention indices of isoparaffins on different phases,
Chromatographia, 1979, 12, 7, 443-447, https://doi.org/10.1007/BF02302987
. [all data]
Chretien and Dubois, 1976
Chretien, J.R.; Dubois, J.-E.,
New Perspectives in the Prediction of Kovats Indices,
J. Chromatogr., 1976, 126, 171-189, https://doi.org/10.1016/S0021-9673(01)84071-1
. [all data]
Lulova, Leont'eva, et al., 1976
Lulova, N.I.; Leont'eva, S.A.; Timofeeva, A.N.,
Gas-chromatographic method of determination of individual hydrocarbons in catalytic cracking gasolines
in Proceedings of All-Union Research Institute on Oil Processes. Vol.18, All-Union Research Institute on Oil Processes, Moscow, 1976, 30-53. [all data]
Riedo, Fritz, et al., 1976
Riedo, F.; Fritz, D.; Tarján, G.; Kováts, E.Sz.,
A tailor-made C87 hydrocarbon as a possible non-polar standard stationary phase for gas chromatography,
J. Chromatogr., 1976, 126, 63-83, https://doi.org/10.1016/S0021-9673(01)84063-2
. [all data]
Mitra, Mohan, et al., 1974
Mitra, G.D.; Mohan, G.; Sinha, A.,
Gas chromatographic analysis of complex hydrocarbon mixtures,
J. Chromatogr. A, 1974, 91, 633-648, https://doi.org/10.1016/S0021-9673(01)97944-0
. [all data]
Rijks and Cramers, 1974
Rijks, J.A.; Cramers, C.A.,
High precision capillary gas chromatography of hydrocarbons,
Chromatographia, 1974, 7, 3, 99-106, https://doi.org/10.1007/BF02269819
. [all data]
Castello, Berg, et al., 1973
Castello, G.; Berg, M.; Lunardelli, M.,
Temperature dependence of the retention indices of branched-chain paraffins on non-polar stationary phases. A method for its calculation on the basis of molecular structure,
J. Chromatogr., 1973, 79, 23-31, https://doi.org/10.1016/S0021-9673(01)85270-5
. [all data]
Pacáková, Hoch, et al., 1973
Pacáková, V.; Hoch, K.; Smolková, E.,
The Effect of Instrumentation on the Precision of Retention Indexes,
Chromatographia, 1973, 6, 7, 320-324, https://doi.org/10.1007/BF02269334
. [all data]
Sidorov, Petrova, et al., 1972
Sidorov, R.I.; Petrova, V.I.; Ivanova, M.P.,
Qualitative analysis of wide-boiling fraction C5-C10 with capillary chromatography
in Processes in chromatographic columns. Vol.17, 1972, 14-25. [all data]
Dimov and Schopov, 1971
Dimov, N.; Schopov, D.,
Empirische korrektion der physikalisch-chemischen retentionsindexe von kohlenwasserstoffen auf squalan,
J. Chromatogr., 1971, 63, 223-228, https://doi.org/10.1016/S0021-9673(01)85634-X
. [all data]
Mitra and Saha, 1970
Mitra, G.D.; Saha, N.C.,
Determination of Retention Indices of Saturated Hydrocarbons by Graphical Methods,
J. Chromatogr. Sci., 1970, 8, 2, 95-102, https://doi.org/10.1093/chromsci/8.2.95
. [all data]
Matukuma, 1969
Matukuma, A.,
Retention indices of alkanes through C10 and alkenes through C8 and relation between boiling points and retention data,
Gas Chromatogr., Int. Symp. Anal. Instrum. Div Instrum Soc. Amer., 1969, 7, 55-75. [all data]
Hively and Hinton, 1968
Hively, R.A.; Hinton, R.E.,
Variation of the retention index with temperature on squalane substrates,
J. Gas Chromatogr., 1968, 6, 4, 203-217, https://doi.org/10.1093/chromsci/6.4.203
. [all data]
Tourres, 1967
Tourres, D.A.,
Structural analysis of industrial butene dimers by gas chromatography,
J. Gas Chromatogr., 1967, 5, 1, 35-40, https://doi.org/10.1093/chromsci/5.1.35
. [all data]
Tourres, 1967, 2
Tourres, D.A.,
Structure moléculaire et rétention en chromatographie en phase gazeuse. Influence de la température sur l'indice de rétention d'alcanes isomères,
J. Chromatogr., 1967, 30, 357-377, https://doi.org/10.1016/S0021-9673(00)84168-0
. [all data]
Evans, 1966
Evans, M.B.,
Retention indices of solutes on squalane, dinonyl phthalate, and polyethylene glycol 400,
J. Gas Chromatogr., 1966, 4, 1, 1-3, https://doi.org/10.1093/chromsci/4.1.1
. [all data]
Ramarathnam, Rubin, et al., 1993
Ramarathnam, N.; Rubin, L.J.; Diosady, L.L.,
Studies on meat flavor. 3. A novel method for trapping volatile components from uncured and cured pork,
J. Agric. Food Chem., 1993, 41, 6, 933-938, https://doi.org/10.1021/jf00030a019
. [all data]
Rembold, Wallner, et al., 1989
Rembold, H.; Wallner, P.; Nitz, S.; Kollmannsberger, H.; Drawert, F.,
Volatile components of chickpea (Cicer arietinum L.) seed,
J. Agric. Food Chem., 1989, 37, 3, 659-662, https://doi.org/10.1021/jf00087a018
. [all data]
Hayes and Pitzer, 1982
Hayes, P.C., Jr.; Pitzer, E.W.,
Characterizing petroleum- and shale-derived jet fuel distillates via temperature-programmed Kováts indices,
J. Chromatogr., 1982, 253, 179-198, https://doi.org/10.1016/S0021-9673(01)88376-X
. [all data]
Louis, 1971
Louis, R.,
Kovats-index-tafeln zur gaschromatographischen analyse von kohlenwasserstoffgemischen,
Erdoel Kohle Erdgas Petrochem., 1971, 24, 2, 88-94. [all data]
Haagen-Smit Laboratory, 1997
Haagen-Smit Laboratory,
Procedure for the detailed hydrocarbon analysis of gasolines by single column high efficiency (capillary) column gas chromatography, SOP NO. MLD 118, Revision No. 1.1, California Environmental Protection Agency, Air Resources Board, El Monte, California, 1997, 22. [all data]
Hoekman, 1993
Hoekman, S.K.,
Improved gas chromatography procedure for speciated hydrocarbon measurements of vehicle emissions,
J. Chromatogr., 1993, 639, 2, 239-253, https://doi.org/10.1016/0021-9673(93)80260-F
. [all data]
Censullo, Jones, et al., 2003
Censullo, A.C.; Jones, D.R.; Wills, M.T.,
Speciation of the volatile organic compounds (VOCs) in solventborne aerosol coatings by solid phase microextraction-gas chromatography,
J. Coat. Technol., 2003, 75, 936, 47-53, https://doi.org/10.1007/BF02697922
. [all data]
LECO Corporation, 2003
LECO Corporation,
Determination of hydrocarbon components in petroleum naphthas, 2003, retrieved from http://www.leco.org/customersupport/apps/separationscience/-190.pdf. [all data]
Xu, van Stee, et al., 2003
Xu, X.; van Stee, L.L.P.; Williams, J.; Beens, J.; Adahchour, M.; Vreuls, R.J.J.; Brinkman, U.A.Th.; Lelieveld, J.,
Comprehensive two-dimensional gas chromatography (GC×GC) measurements of volatile organic compounds in the atmosphere,
Atmos. Chem. Phys., 2003, 3, 3, 665-682, https://doi.org/10.5194/acp-3-665-2003
. [all data]
Yin, Liu, et al., 2001
Yin, C.; Liu, W.; Li, Z.; Pan, Z.; Lin, T.; Zhang, M.,
Chemometrics to chemical modeling: structural coding in hydrocarbons and retention indices of gas chromatography,
J. Sep. Sci., 2001, 24, 3, 213-220, https://doi.org/10.1002/1615-9314(20010301)24:3<213::AID-JSSC213>3.0.CO;2-4
. [all data]
Subramaniam, Bochniak, et al., 1994
Subramaniam, B.; Bochniak, D.; Snavely, K.,
Fischer-Tropsch synthesis in supercritical reaction media, Lawrence Department of Chemical and Petroleum Engineering (DOE/PC/92532--T7), United States Department of Energy, Pittsburgh, PA, 1994, 8, retrieved from http://www.NTIS.gov. [all data]
White, Hackett, et al., 1992
White, C.M.; Hackett, J.; Anderson, R.R.; Kail, S.; Spock, P.S.,
Linear temperature programmed retention indices of gasoline range hydrocarbons and chlorinated hydrocarbons on cross-linked polydimethylsiloxane,
J. Hi. Res. Chromatogr., 1992, 15, 2, 105-120, https://doi.org/10.1002/jhrc.1240150211
. [all data]
Hayes and Pitzer, 1981
Hayes, P.C., Jr.; Pitzer, E.W.,
Kovats indices as a tool in characterizing hydrocarbon fuels in temperature programmed glass capillary gas chromatography. Part 1. Qualitative identification, Inhouse rpt. for Air Force Wright Aeronautical Labs., Air Force Wright Aeronautical Labs., Wright-Patterson AFB, Ohio, 1981, 75. [all data]
Hassoun, Pilling, et al., 1999
Hassoun, S.; Pilling, M.J.; Bartle, K.D.,
A catalogue of urban hydrocarbons for the city of Leeds: atmospheric monitoring of volatile organic compounds by thermal desorption-gas chromatography,
J. Environ. Monitor., 1999, 1, 5, 453-458, https://doi.org/10.1039/a904879k
. [all data]
Wu and Lu, 1984
Wu, J.; Lu, W.,
Hydrocarbon analysis by open-tubular column chromatography with programmed temperature for straight run gasoline,
Anal. Chem., 1984, 12, 7, 572-578. [all data]
Li and Deng, 1998
Li, H.; Deng, C.,
Qualitative analysis of light components of gasoline cracking using Kovats retention indices,
J. Instrumental Analysis, 1998, 17, 1, 67-69. [all data]
Wu and Lu, 1984, 2
Wu, J.; Lu, W.,
Kovats indices of C4-C10 hydrocarbons in apolar quartz capillary OV-101,
Chin. J. Chromatogr., 1984, 1, 1, 11-17. [all data]
Dimov N., 1976
Dimov N.,
Quantitative gas chromatographic analysis and determination of solute properties. An exact equation for the calculation of the retention indices of isoalkanes on Squalane,
J. Chromatogr., 1976, 119, 109-118, https://doi.org/10.1016/S0021-9673(00)86775-8
. [all data]
Vigdergauz and Martynov, 1971
Vigdergauz, M.S.; Martynov, A.A.,
Some applications of the gas chromatographic linear retention indices,
Chromatographia, 1971, 4, 10, 463-467, https://doi.org/10.1007/BF02268816
. [all data]
Schomburg, 1966
Schomburg, G.,
Gaschromatographische Retentionsdaten und Struktur Chemischer Verbindungen. II. Methylverzweigungen und Doppelbindungen in Offenkettigen Kohlenwasserstoffen,
J. Chromatogr., 1966, 23, 1-17, https://doi.org/10.1016/S0021-9673(01)98652-2
. [all data]
Bramston-Cook, 2013
Bramston-Cook, R.,
Kovats indices for C2-C13 hydrocarbons and selected oxygenated/halocarbons with 100 % dimethylpolysiloxane columns, 2013, retrieved from http://lotusinstruments.com/monographs/List .... [all data]
Supelco, 2012
Supelco, CatalogNo. 24160-U,
Petrocol DH Columns. Catalog No. 24160-U, 2012, retrieved from http://www.sigmaaldrich.com/etc/medialib/docs/Supelco/Datasheet/1/w97949.Par.0001.File.tmp/w97949.pdf. [all data]
Zhang, Ding, et al., 2009
Zhang, X.; Ding, L.; Sun, Z.; Song, L.; Sun, T.,
Study on quantitative structure-retention relationships for hydrocarbons in FCC gasoline,
Chromatographia, 2009, 70, 3/4, 511-518, https://doi.org/10.1365/s10337-009-1174-0
. [all data]
Health Safety Executive, 2000
Health Safety Executive,
MDHS 96 Volatile organic compounds in air - Laboratory method using pumed solid sorbent tubes, solvent desorption and gas chromatography
in Methods for the Determination of Hazardous Substances (MDHS) guidance, Crown, Colegate, Norwich, 2000, 1-24, retrieved from http://www.hse.gov.uk/pubns/mdhs/pdfs/mdhs96.pdf. [all data]
Orav, Kailas, et al., 1999
Orav, A.; Kailas, T.; Muurisepp, M.; Kann, J.,
Composition of the oil from waste tires. 1. Fraction boiling at yp to 160 0C,
Proc. Estonian Acad. Sci. Chem., 1999, 48, 1, 30-39. [all data]
Ciccioli, Cecinato, et al., 1992
Ciccioli, P.; Cecinato, A.; Brancaleoni, E.; Frattoni, M.; Liberti, A.,
Use of carbon adsorption traps combined with high resolution gas chromatography - mass spectrometry for the analysis of polar and non-polar C4-C14 hydrocarbons involved in photochemical smog formation,
J. Hi. Res. Chromatogr., 1992, 15, 2, 75-84, https://doi.org/10.1002/jhrc.1240150205
. [all data]
Chen and Feng, 2007
Chen, Y.; Feng, C.,
QSPR study on gas chromatography retention index of some organic pollutants,
Comput. Appl. Chem. (China), 2007, 24, 10, 1404-1408. [all data]
Feng and Mu, 2007
Feng, H.; Mu, L.-L.,
Quantitative structure-retention relationships for alkane and its derivatives based on electrotopological state index and molecular shape index,
Chem. Ind. Engineering (Chinese), 2007, 24, 2, 161-168. [all data]
Blunden, Aneja, et al., 2005
Blunden, J.; Aneja, V.P.; Lonneman, W.A.,
Characterization of non-methane volatile organic compounds at swine facilities in eastern North Carolina,
Atm. Environ., 2005, 39, 36, 6707-6718, https://doi.org/10.1016/j.atmosenv.2005.03.053
. [all data]
Du and Liang, 2003
Du, Y.; Liang, Y.,
Data mining for seeking accurate quantitative relationship between molecular structure and GC retention indices of alkanes by projection pursuit,
Comput. Biol. Chem., 2003, 27, 3, 339-353, https://doi.org/10.1016/S1476-9271(02)00081-6
. [all data]
Yin, Guo, et al., 2001
Yin, C.; Guo, W.; Lin, T.; Liu, S.; Fu, R.; Pan, Z.; Wang, L.,
Application of wavelet neural network to the prediction of gas chromatographic retention indices of alkanes,
J. Chinese Chem. Soc., 2001, 48, 739-749. [all data]
Spieksma, 1999
Spieksma, W.,
Determination of vapor liquid equilibrium from the Kovats retention index on dimethylsilicone using the Wilson mixing tool,
J. Hi. Res. Chromatogr., 1999, 22, 10, 565-588, https://doi.org/10.1002/(SICI)1521-4168(19991001)22:10<565::AID-JHRC565>3.0.CO;2-2
. [all data]
Zhu and He, 1999
Zhu, X.; He, L.,
Derivation of isothermal retention indices from a retention values under multiple-ramp temperature-programmed conditions,
J. Instrum. Anal. (Chinese), 1999, 18, 6, 10-12. [all data]
Xu, Chu, et al., 1995
Xu, X.; Chu, S.; Song, N.,
Application of chromatographic studies of air pollution in China,
J. Chromatogr. A, 1995, 710, 1, 21-37, https://doi.org/10.1016/0021-9673(95)00173-K
. [all data]
Ciccioli, Cecinato, et al., 1994
Ciccioli, P.; Cecinato, A.; Brancaleoni, E.; Brachetti, A.; Frattoni, M.; Sparapani, R.,
Composition and Distribution of Polar and Non-Polar VOCs in Urban, Rural, Forest and Remote Areas,
Eur Commission EUR, 1994, 549-568. [all data]
Skrbic and Cvejanov, 1993
Skrbic, B.D.; Cvejanov, J.Dj.,
Correlation of unified retention indices for OV-101 and squalane,
Chromatographia, 1993, 35, 1/2, 109-110, https://doi.org/10.1007/BF02278566
. [all data]
Petrov, 1984
Petrov, A.A.,
Hydrocarbons of petroleum, Nauka (publishing house), Moscow, 1984, 263. [all data]
Waggott and Davies, 1984
Waggott, A.; Davies, I.W.,
Identification of organic pollutants using linear temperature programmed retention indices (LTPRIs) - Part II, 1984, retrieved from http://dwi.defra.gov.uk/research/completed-research/reports/dwi0383.pdf. [all data]