Formic acid, 1-methylpropyl ester
- Formula: C5H10O2
- Molecular weight: 102.1317
- IUPAC Standard InChIKey: OAEQYDZVVPONKW-UHFFFAOYSA-N
- CAS Registry Number: 589-40-2
- Chemical structure:
View 3d structure (requires JavaScript / HTML 5) - Other names: Formic acid, sec-butyl ester; sec-Butyl Formate; sec-Butyl methanoate; s-Butyl formate; 1-Methylpropyl formate; butan-2-yl formate

Phase change data

Data compiled as indicated in comments:
AC - William E. Acree, Jr., James S. Chickos
Enthalpy of vaporization
ΔvapH (kJ/mol) | Temperature (K) | Method | Reference | Comment |
---|---|---|---|---|
37.7 | 253. | A | Stephenson and Malanowski, 1987 | Based on data from 238. to 367. K.; AC |
Antoine Equation Parameters
log10(P) = A − (B / (T + C))
P = vapor pressure (bar)
T = temperature (K)
View plot Requires a JavaScript / HTML 5 canvas capable browser.
Temperature (K) | A | B | C | Reference | Comment |
---|---|---|---|---|---|
302.9 to 373.0 | 3.59606 | 969.595 | -96.642 | Nelson, 1928 | Coefficents calculated by NIST from author's data. |

Kovats' RI, non-polar column, isothermal

Column type | Active phase | Temperature (C) | I | Reference | Comment |
---|---|---|---|---|---|
Packed | Apiezon L | 120. | 633. | Bogoslovsky, Anvaer, et al., 1978 | Celite 545 |
Packed | Apiezon L | 160. | 640. | Bogoslovsky, Anvaer, et al., 1978 | Celite 545 |
Packed | Apiezon L | 130. | 631. | Wehrli and Kováts, 1959 | Celite; Column length: 2.25 m |
Packed | Apiezon L | 70. | 632. | Wehrli and Kováts, 1959 | Celite; Column length: 2.25 m |

References

Stephenson and Malanowski, 1987
Stephenson, Richard M.; Malanowski, Stanislaw,
Handbook of the Thermodynamics of Organic Compounds, 1987, https://doi.org/10.1007/978-94-009-3173-2
. [all data]
Nelson, 1928
Nelson, O.A.,
Vapor Pressures of Fumigants: II---Methyl, Ethyl, n-Propyl, Isopropyl, n-Butyl, Secondary Butyl and Isobutyl Formates 1,
Ind. Eng. Chem., 1928, 20, 12, 1382-1384, https://doi.org/10.1021/ie50228a035
. [all data]
Bogoslovsky, Anvaer, et al., 1978
Bogoslovsky, Yu.N.; Anvaer, B.I.; Vigdergauz, M.S.,
Chromatographic constants in gas chromatography (in Russian), Standards Publ. House, Moscow, 1978, 192. [all data]
Wehrli and Kováts, 1959
Wehrli, A.; Kováts, E.,
Gas-chromatographische Charakterisierung ogranischer Verbindungen. Teil 3: Berechnung der Retentionsindices aliphatischer, alicyclischer und aromatischer Verbindungen,
Helv. Chim. Acta, 1959, 7, 7, 2709-2736, https://doi.org/10.1002/hlca.19590420745
. [all data]