Pentanebis(dithioperoxoic) acid, hexafluoro-bis(trifluoromethyl) ester

Phase change data

Data compiled by: William E. Acree, Jr., James S. Chickos

Enthalpy of vaporization

ΔvapH (kJ/mol) Temperature (K) Method Reference
33.6370.IBurton and Shreeve, 1976

References

Burton and Shreeve, 1976
Burton, Craig A.; Shreeve, Jean'ne M., Trifluoromethyldisulfane. A reactive nucleophile toward fluorinated acid halides, J. Am. Chem. Soc., 1976, 98, 21, 6545-6547, https://doi.org/10.1021/ja00437a021 . [all data]