1-Pentanol, 3-methyl-
- Formula: C6H14O
- Molecular weight: 102.1748
- IUPAC Standard InChIKey: IWTBVKIGCDZRPL-UHFFFAOYSA-N
- CAS Registry Number: 589-35-5
- Chemical structure:
View 3d structure (requires JavaScript / HTML 5) - Species with the same structure:
- Stereoisomers:
- Other names: 3-Ethyl-1-butanol; 2-Ethyl-4-butanol; 3-Methyl-1-pentanol; 3-Methylpentanol; 3-Methylpentan-1-ol

Phase change data

Data compiled as indicated in comments:
BS - Robert L. Brown and Stephen E. Stein
TRC - Thermodynamics Research Center, NIST Boulder Laboratories, Chris Muzny director
AC - William E. Acree, Jr., James S. Chickos
Quantity | Value | Units | Method | Reference | Comment |
---|---|---|---|---|---|
Tboil | 426. ± 2. | K | AVG | N/A | Average of 14 out of 15 values; Individual data points |
Quantity | Value | Units | Method | Reference | Comment |
ΔvapH° | 61.7 ± 0.3 | kJ/mol | GS | Kulikov, Verevkin, et al., 2001 | Based on data from 280. to 316. K.; AC |
Enthalpy of vaporization
ΔvapH (kJ/mol) | Temperature (K) | Method | Reference | Comment |
---|---|---|---|---|
54.8 | 343. | A | Stephenson and Malanowski, 1987 | Based on data from 328. to 427. K.; AC |
59.7 | 313. | N/A | Wilhoit and Zwolinski, 1973 | Based on data from 298. to 427. K.; AC |
47.2 | 360. | I | Hovorka, Lankelma, et al., 1940 | Based on data from 298. to 423. K.; AC |

Gas phase ion energetics data

Data compiled by: John E. Bartmess
De-protonation reactions
C6H13O- + =
By formula: C6H13O- + H+ = C6H14O
Quantity | Value | Units | Method | Reference | Comment |
---|---|---|---|---|---|
ΔrH° | 1563. ± 8.4 | kJ/mol | CIDC | Haas and Harrison, 1993 | gas phase; Both metastable and 50 eV collision energy. |
Quantity | Value | Units | Method | Reference | Comment |
ΔrG° | 1536. ± 8.8 | kJ/mol | H-TS | Haas and Harrison, 1993 | gas phase; Both metastable and 50 eV collision energy. |

Reaction thermochemistry data

Data compiled by: John E. Bartmess
Individual Reactions
C6H13O- + =
By formula: C6H13O- + H+ = C6H14O
Quantity | Value | Units | Method | Reference | Comment |
---|---|---|---|---|---|
ΔrH° | 1563. ± 8.4 | kJ/mol | CIDC | Haas and Harrison, 1993 | gas phase; Both metastable and 50 eV collision energy. |
Quantity | Value | Units | Method | Reference | Comment |
ΔrG° | 1536. ± 8.8 | kJ/mol | H-TS | Haas and Harrison, 1993 | gas phase; Both metastable and 50 eV collision energy. |

Van Den Dool and Kratz RI, non-polar column, temperature ramp

Data compiled by: NIST Mass Spectrometry Data Center, William E. Wallace, director

Column type Capillary
Active phase OV-1
Column length (m) 183.
Carrier gas
Substrate
Column diameter (mm) 0.762
Phase thickness (μm)
Tstart (C) 0.
Tend (C) 230.
Heat rate (K/min) 1.
Initial hold (min)
Final hold (min)
I 826.
ReferenceSchreyen, Dirinck, et al., 1976
Comment MSDC-RI

Kovats' RI, polar column, isothermal

Data compiled by: NIST Mass Spectrometry Data Center, William E. Wallace, director

Column type CapillaryCapillary
Active phase Carbowax 20MCarbowax 20M
Column length (m) 50.50.
Carrier gas N2N2
Substrate
Column diameter (mm) 0.230.23
Phase thickness (μm)
Temperature (C) 80.90.
I 1344.1344.
ReferenceBoneva, 1987Boneva, 1987
Comment MSDC-RI MSDC-RI

Van Den Dool and Kratz RI, polar column, temperature ramp

Data compiled by: NIST Mass Spectrometry Data Center, William E. Wallace, director

Column type CapillaryCapillaryCapillaryCapillary
Active phase DB-WaxDB-WaxSupelcowax-10ZB-Wax
Column length (m) 60.30.60.30.
Carrier gas HeHeHeHe
Substrate
Column diameter (mm) 0.250.320.250.25
Phase thickness (μm) 0.250.50.250.15
Tstart (C) 40.40.40.35.
Tend (C) 265.265.280.220.
Heat rate (K/min) 7.7.4.1.8
Initial hold (min)   2.10.
Final hold (min) 5.5. 10.
I 1331.1334.1328.1323.
ReferenceGurbuz O., Rouseff J.M., et al., 2006Gurbuz O., Rouseff J.M., et al., 2006Elmore, Nisyrios, et al., 2005Ledauphin, Saint-Clair, et al., 2004
Comment MSDC-RI MSDC-RI MSDC-RI MSDC-RI

References

Kulikov, Verevkin, et al., 2001
Kulikov, Dmitry; Verevkin, Sergey P.; Heintz, Andreas,
Determination of Vapor Pressures and Vaporization Enthalpies of the Aliphatic Branched C 5 and C 6 Alcohols,
J. Chem. Eng. Data, 2001, 46, 6, 1593-1600, https://doi.org/10.1021/je010187p
. [all data]
Stephenson and Malanowski, 1987
Stephenson, Richard M.; Malanowski, Stanislaw,
Handbook of the Thermodynamics of Organic Compounds, 1987, https://doi.org/10.1007/978-94-009-3173-2
. [all data]
Wilhoit and Zwolinski, 1973
Wilhoit, R.C.; Zwolinski, B.J.,
Physical and thermodynamic properties of aliphatic alcohols,
J. Phys. Chem. Ref. Data Suppl., 1973, 1, 2, 1. [all data]
Hovorka, Lankelma, et al., 1940
Hovorka, Frank; Lankelma, Herman P.; Schneider, Isadore,
Thermodynamic Properties of the Hexyl Alcohols. IV. 3-Methylpentanol-1 and 2-Methylpentanol-5,
J. Am. Chem. Soc., 1940, 62, 5, 1096-1098, https://doi.org/10.1021/ja01862a029
. [all data]
Haas and Harrison, 1993
Haas, M.J.; Harrison, A.G.,
The Fragmentation of Proton-Bound Cluster Ions and the Gas-Phase Acidities of Alcohols,
Int. J. Mass Spectrom. Ion Proc., 1993, 124, 2, 115, https://doi.org/10.1016/0168-1176(93)80003-W
. [all data]