Hexane, 3-methyl-
- Formula: C7H16
- Molecular weight: 100.2019
- IUPAC Standard InChIKey: VLJXXKKOSFGPHI-UHFFFAOYSA-N
- CAS Registry Number: 589-34-4
- Chemical structure:
View 3d structure (requires JavaScript / HTML 5) - Stereoisomers:
- Other names: 2-Ethylpentane; 3-Methylhexane

Gas phase thermochemistry data

Data compiled as indicated in comments:
ALS - Hussein Y. Afeefy, Joel F. Liebman, and Stephen E. Stein
DRB - Donald R. Burgess, Jr.
Quantity | Value | Units | Method | Reference | Comment |
---|---|---|---|---|---|
ΔfH°gas | -45.96 ± 0.30 | kcal/mol | Ccb | Prosen and Rossini, 1945 | ALS |
ΔfH°gas | -46.10 | kcal/mol | N/A | Davies and Gilbert, 1941 | Value computed using ΔfHliquid° value of -228.0±1.0 kj/mol from Davies and Gilbert, 1941 and ΔvapH° value of 35.1 kj/mol from Prosen and Rossini, 1945.; DRB |

Condensed phase thermochemistry data

Data compiled as indicated in comments:
ALS - Hussein Y. Afeefy, Joel F. Liebman, and Stephen E. Stein
DH - Eugene S. Domalski and Elizabeth D. Hearing
Quantity | Value | Units | Method | Reference | Comment |
---|---|---|---|---|---|
ΔfH°liquid | -54.35 ± 0.30 | kcal/mol | Ccb | Prosen and Rossini, 1945 | ALS |
ΔfH°liquid | -54.4 ± 0.3 | kcal/mol | Ccb | Davies and Gilbert, 1941 | ALS |
Quantity | Value | Units | Method | Reference | Comment |
ΔcH°liquid | -1150.55 ± 0.28 | kcal/mol | Ccb | Prosen and Rossini, 1945 | Corresponding ΔfHºliquid = -54.33 kcal/mol (simple calculation by NIST; no Washburn corrections); ALS |
ΔcH°liquid | -1150.3 ± 0.3 | kcal/mol | Ccb | Davies and Gilbert, 1941 | Corresponding ΔfHºliquid = -54.63 kcal/mol (simple calculation by NIST; no Washburn corrections); ALS |
Quantity | Value | Units | Method | Reference | Comment |
S°liquid | 74.00 | cal/mol*K | N/A | Huffman, Parks, et al., 1930 | Extrapolation below 70 K, 70.71 J/mol*K. Forms glass at low temperatures. Value includes estimated zero point entropy of 17 J/mol*K.; DH |
Constant pressure heat capacity of liquid
Cp,liquid (cal/mol*K) | Temperature (K) | Reference | Comment |
---|---|---|---|
51.79 | 289.2 | Parks, Thomas, et al., 1936 | T = 71 to 290 K. Glass at lower temperatures. Value is unsmoothed experimental datum.; DH |
51.20 | 289.2 | Huffman, Parks, et al., 1930 | T = 71 to 289 K. Value is unsmoothed experimental datum.; DH |

Phase change data

Data compiled as indicated in comments:
BS - Robert L. Brown and Stephen E. Stein
TRC - Thermodynamics Research Center, NIST Boulder Laboratories, Chris Muzny director
AC - William E. Acree, Jr., James S. Chickos
Quantity | Value | Units | Method | Reference | Comment |
---|---|---|---|---|---|
Tboil | 365.0 ± 0.3 | K | AVG | N/A | Average of 34 out of 38 values; Individual data points |
Quantity | Value | Units | Method | Reference | Comment |
Tfus | 153.75 | K | N/A | Timmermans, 1921 | Uncertainty assigned by TRC = 0.5 K; TRC |
Quantity | Value | Units | Method | Reference | Comment |
Tc | 535.2 ± 0.4 | K | N/A | Daubert, 1996 | |
Tc | 535.2 | K | N/A | Majer and Svoboda, 1985 | |
Tc | 535.19 | K | N/A | McMicking and Kay, 1965 | Uncertainty assigned by TRC = 0.4 K; TRC |
Tc | 535.55 | K | N/A | Edgar and Calingaert, 1929 | Uncertainty assigned by TRC = 0.5 K; measured by Keys and Kleinschmidt; TRC |
Quantity | Value | Units | Method | Reference | Comment |
Pc | 27.7 ± 0.4 | atm | N/A | Daubert, 1996 | |
Pc | 27.767 | atm | N/A | McMicking and Kay, 1965 | Uncertainty assigned by TRC = 0.4000 atm; TRC |
Pc | 28.13 | atm | N/A | Edgar and Calingaert, 1929 | Uncertainty assigned by TRC = 50.663 atm; measured by Keys and Kleinschmidt; TRC |
Quantity | Value | Units | Method | Reference | Comment |
Vc | 0.404 | l/mol | N/A | Daubert, 1996 | |
Quantity | Value | Units | Method | Reference | Comment |
ρc | 2.47 ± 0.04 | mol/l | N/A | Daubert, 1996 | |
ρc | 2.48 | mol/l | N/A | McMicking and Kay, 1965 | Uncertainty assigned by TRC = 0.05 mol/l; TRC |
Quantity | Value | Units | Method | Reference | Comment |
ΔvapH° | 8.403 | kcal/mol | N/A | Majer and Svoboda, 1985 | |
ΔvapH° | 8.39 ± 0.02 | kcal/mol | C | Majer, Svoboda, et al., 1979 | AC |
ΔvapH° | 8.39 | kcal/mol | N/A | Reid, 1972 | AC |
Enthalpy of vaporization
ΔvapH (kcal/mol) | Temperature (K) | Method | Reference | Comment |
---|---|---|---|---|
7.383 | 365. | N/A | Majer and Svoboda, 1985 | |
8.39 | 304. | A | Stephenson and Malanowski, 1987 | Based on data from 289. to 366. K.; AC |
8.17 ± 0.02 | 313. | C | Majer, Svoboda, et al., 1979 | AC |
7.86 ± 0.02 | 333. | C | Majer, Svoboda, et al., 1979 | AC |
7.58 ± 0.02 | 353. | C | Majer, Svoboda, et al., 1979 | AC |
8.34 | 308. | N/A | Forziati, Norris, et al., 1949 | Based on data from 293. to 366. K.; AC |
Enthalpy of vaporization
ΔvapH =
A exp(-βTr) (1 − Tr)β
ΔvapH =
Enthalpy of vaporization (at saturation pressure)
(kcal/mol)
Tr = reduced temperature (T / Tc)
View plot Requires a JavaScript / HTML 5 canvas capable browser.
Temperature (K) | A (kcal/mol) | β | Tc (K) | Reference | Comment |
---|---|---|---|---|---|
298. to 353. | 12.3 | 0.2776 | 535.2 | Majer and Svoboda, 1985 |
Antoine Equation Parameters
log10(P) = A − (B / (T + C))
P = vapor pressure (atm)
T = temperature (K)
View plot Requires a JavaScript / HTML 5 canvas capable browser.
Temperature (K) | A | B | C | Reference | Comment |
---|---|---|---|---|---|
293.06 to 365.89 | 3.99314 | 1243.759 | -53.524 | Forziati, Norris, et al., 1949, 2 | Coefficents calculated by NIST from author's data. |

Reaction thermochemistry data

Data compiled by: Hussein Y. Afeefy, Joel F. Liebman, and Stephen E. Stein
Individual Reactions
By formula: C7H14 + H2 = C7H16
Quantity | Value | Units | Method | Reference | Comment |
---|---|---|---|---|---|
ΔrH° | -25.7 ± 0.1 | kcal/mol | Chyd | Rogers and Dejroongruang, 1988 | liquid phase; solvent: Hydrocarbone |
By formula: H2 + C7H14 = C7H16
Quantity | Value | Units | Method | Reference | Comment |
---|---|---|---|---|---|
ΔrH° | -27.39 ± 0.26 | kcal/mol | Chyd | Rogers and Dejroongruang, 1989 | liquid phase; solvent: Cyclohexane |
By formula: H2 + C7H14 = C7H16
Quantity | Value | Units | Method | Reference | Comment |
---|---|---|---|---|---|
ΔrH° | -29.76 ± 0.1 | kcal/mol | Chyd | Rogers and Dejroongruang, 1988 | liquid phase; solvent: Hydrocarbone |
By formula: H2 + C7H14 = C7H16
Quantity | Value | Units | Method | Reference | Comment |
---|---|---|---|---|---|
ΔrH° | -29.33 ± 0.07 | kcal/mol | Chyd | Rogers and Dejroongruang, 1988 | liquid phase; solvent: Hydrocarbone |
By formula: H2 + C7H14 = C7H16
Quantity | Value | Units | Method | Reference | Comment |
---|---|---|---|---|---|
ΔrH° | -27.63 ± 0.07 | kcal/mol | Chyd | Rogers and Dejroongruang, 1988 | liquid phase; solvent: Hydrocarbone |
By formula: H2 + C7H14 = C7H16
Quantity | Value | Units | Method | Reference | Comment |
---|---|---|---|---|---|
ΔrH° | -26.58 ± 0.1 | kcal/mol | Chyd | Rogers and Dejroongruang, 1988 | liquid phase; solvent: Hydrocarbone |
By formula: H2 + C7H14 = C7H16
Quantity | Value | Units | Method | Reference | Comment |
---|---|---|---|---|---|
ΔrH° | -26.43 ± 0.1 | kcal/mol | Chyd | Rogers and Dejroongruang, 1988 | liquid phase; solvent: Hydrocarbone |
By formula: H2 + C7H14 = C7H16
Quantity | Value | Units | Method | Reference | Comment |
---|---|---|---|---|---|
ΔrH° | -26.15 ± 0.1 | kcal/mol | Chyd | Rogers and Dejroongruang, 1988 | liquid phase; solvent: Hydrocarbone |
By formula: C7H16 = C7H16
Quantity | Value | Units | Method | Reference | Comment |
---|---|---|---|---|---|
ΔrH° | -0.024 ± 0.050 | kcal/mol | Eqk | Roganov, Kabo, et al., 1972 | gas phase; At 368 K |

Henry's Law data

Data compiled by: Rolf Sander
Henry's Law constant (water solution)
kH(T) = k°H exp(d(ln(kH))/d(1/T) ((1/T) - 1/(298.15 K)))
k°H = Henry's law constant for solubility in water at 298.15 K (mol/(kg*bar))
d(ln(kH))/d(1/T) = Temperature dependence constant (K)
k°H (mol/(kg*bar)) | d(ln(kH))/d(1/T) (K) | Method | Reference | Comment |
---|---|---|---|---|
0.00032 | Q | N/A | missing citation give several references for the Henry's law constants but don't assign them to specific species. | |
0.00042 | L | N/A |

Van Den Dool and Kratz RI, non-polar column, temperature ramp

Data compiled by: NIST Mass Spectrometry Data Center, William E. Wallace, director

Column type CapillaryCapillaryCapillaryCapillaryCapillary
Active phase HP-5Petrocol DHSPB-1SPB-1DB-5
Column length (m) 50.50.30.30.30.
Carrier gas HeHe  He
Substrate
Column diameter (mm) 0.320.250.250.250.25
Phase thickness (μm) 1.050.50.250.251.
Tstart (C) 35.35.40.40.50.
Tend (C) 220.200.250.250.200.
Heat rate (K/min) 8.3.10.10.2.5
Initial hold (min) 15.10.2.2.
Final hold (min) 5.10.2.2.
I 671.673.9666.92667.66672.7
ReferenceInsausti, Goñi, et al., 2005Censullo, Jones, et al., 2003LECO Corporation, 2003LECO Corporation, 2003Xu, van Stee, et al., 2003
Comment MSDC-RI MSDC-RI MSDC-RI MSDC-RI MSDC-RI
Column type CapillaryCapillaryCapillaryCapillaryCapillary
Active phase OV-101Petrocol DHPetrocol DHUltra-1Petrocol DH
Column length (m) 80.100.100. 100.
Carrier gas N2HeHe He
Substrate
Column diameter (mm) 0.220.250.25 0.25
Phase thickness (μm)  0.50.5 0.5
Tstart (C) 30.30.30.-40.30.
Tend (C) 130.220.220.230.220.
Heat rate (K/min) 1.1.1.4.1.
Initial hold (min)
Final hold (min)
I 672.2670.16670.26676.670.56
ReferenceYin, Liu, et al., 2001Subramaniam, Bochniak, et al., 1994Subramaniam, Bochniak, et al., 1994Olson, Sinkevitch, et al., 1992White, Douglas, et al., 1992
Comment MSDC-RI MSDC-RI MSDC-RI MSDC-RI MSDC-RI
Column type CapillaryCapillaryCapillaryCapillaryCapillary
Active phase Petrocol DHPetrocol DHHP-1HP-1HP-1
Column length (m) 100.100.25.25.25.
Carrier gas HeHeN2N2N2
Substrate
Column diameter (mm) 0.250.250.20.20.2
Phase thickness (μm) 0.50.5
Tstart (C) 30.30.30.30.30.
Tend (C) 220.220.
Heat rate (K/min) 1.1.10.2.5.
Initial hold (min)     5.
Final hold (min)
I 670.6671.676.9676.5675.8
ReferenceWhite, Douglas, et al., 1992White, Hackett, et al., 1992Bangjie, Xijian, et al., 1987Bangjie, Xijian, et al., 1987Bangjie, Xijian, et al., 1987
Comment MSDC-RI MSDC-RI MSDC-RI MSDC-RI MSDC-RI
Column type Capillary
Active phase OV-101
Column length (m) 108.
Carrier gas
Substrate
Column diameter (mm) 0.25
Phase thickness (μm) 0.2
Tstart (C) 35.
Tend (C) 200.
Heat rate (K/min) 1.
Initial hold (min)
Final hold (min)
I 669.
ReferenceHayes and Pitzer, 1981
Comment MSDC-RI

Normal alkane RI, polar column, custom temperature program

Data compiled by: NIST Mass Spectrometry Data Center, William E. Wallace, director

Column type Capillary
Active phase HP-Innowax
Column length (m) 30.
Carrier gas Helium
Substrate
Column diameter (mm) 0.25
Phase thickness (μm) 0.25
Program 45 0C (1 min) 5 oC/min -> 170 0C 10 0C/min -> 260 0C (1 min)
I 700.
ReferenceCajka, Riddellova, et al., 2010
Comment MSDC-RI

Normal alkane RI, non-polar column, isothermal

Data compiled by: NIST Mass Spectrometry Data Center, William E. Wallace, director

Column type CapillaryCapillaryCapillaryCapillaryCapillary
Active phase OV-101Methyl SiliconeOV-101OV-101Squalane
Column length (m) 51.74.6
Carrier gas N2N2
Substrate
Column diameter (mm) 0.250.28
Phase thickness (μm)
Temperature (C) 40.50.50.70.100.
I 676.676.676.677.678.
ReferenceLi and Deng, 1998N/AWu and Lu, 1984Wu and Lu, 1984Dimov N., 1976
Comment MSDC-RI MSDC-RI MSDC-RI MSDC-RI MSDC-RI
Column type CapillaryCapillaryCapillaryPacked
Active phase SqualaneSqualaneApiezon LMethyl Silicone
Column length (m)  150.2.2.5
Carrier gas  He Nitrogen
Substrate    Celite C-22
Column diameter (mm)  0.35
Phase thickness (μm)
Temperature (C) 70.86.40. - 190.50.
I 677.669.676.664.
ReferenceDimov N., 1976Vigdergauz and Martynov, 1971Mann, Mühlstädt, et al., 1967Huguet, 1961
Comment MSDC-RI MSDC-RI MSDC-RI MSDC-RI

Van Den Dool and Kratz RI, non-polar column, custom temperature program

Data compiled by: NIST Mass Spectrometry Data Center, William E. Wallace, director

Column type CapillaryCapillaryCapillary
Active phase DB-5Methyl SiliconeOV-101
Column length (m) 30.50.
Carrier gas HeHe
Substrate
Column diameter (mm) 0.250.25
Phase thickness (μm)  1.
Program 30C => 5K/min=120C => 10C/min => 270C-50C(2min) => 49.9C/min => 35C(10min) => 3C/min => 200C(2min) => 40C/min => 240C(30min)not specified
I 671.669.20672.
ReferenceZaikin and Borisov, 2002Hassoun, Pilling, et al., 1999Wu and Lu, 1984
Comment MSDC-RI MSDC-RI MSDC-RI

References

Prosen and Rossini, 1945
Prosen, E.J.; Rossini, F.D.,
Heats of combustion and formation of the paraffin hydrocarbons at 25° C,
J. Res. NBS, 1945, 263-267. [all data]
Davies and Gilbert, 1941
Davies, G.F.; Gilbert, E.C.,
Heats of combustion and formation of the nine isomeric heptanes in the liquid state,
J. Am. Chem. Soc., 1941, 63, 2730-2732. [all data]
Huffman, Parks, et al., 1930
Huffman, H.M.; Parks, G.S.; Thomas, S.B.,
Thermal data on organic compounds. VIII. The heat capacities, entropies and free energies of the isomeric heptanes,
J. Am. Chem. Soc., 1930, 52, 3241-3251. [all data]
Parks, Thomas, et al., 1936
Parks, G.S.; Thomas, S.B.; Light, D.W.,
XII. Some new heat capacity data for organic glasses. The entropy and free energy of DL-lactic acid,
J. Chem. Phys., 1936, 4, 64-69. [all data]
Timmermans, 1921
Timmermans, J.,
The Freezing Points of Organic Substances IV. New Exp. Determinations,
Bull. Soc. Chim. Belg., 1921, 30, 62. [all data]
Daubert, 1996
Daubert, T.E.,
Vapor-Liquid Critical Properties of Elements and Compounds. 5. Branched Alkanes and Cycloalkanes,
J. Chem. Eng. Data, 1996, 41, 365-372. [all data]
Majer and Svoboda, 1985
Majer, V.; Svoboda, V.,
Enthalpies of Vaporization of Organic Compounds: A Critical Review and Data Compilation, Blackwell Scientific Publications, Oxford, 1985, 300. [all data]
McMicking and Kay, 1965
McMicking, J.H.; Kay, W.B.,
Vapor Pressures and Saturated Liquid and Vapor Densities of The Isomeric Heptanes and Isomeric Octanes,
Proc., Am. Pet. Inst., Sect. 3, 1965, 45, 75-90. [all data]
Edgar and Calingaert, 1929
Edgar, G.; Calingaert, G.,
Preparation and Properties of the Isomeric Heptanes II. Physical Prop. properties,
J. Am. Chem. Soc., 1929, 51, 1540. [all data]
Majer, Svoboda, et al., 1979
Majer, Vladimír; Svoboda, Václav; Hála, Slavoj; Pick, Jirí,
Temperature dependence of heats of vaporization of saturated hydrocarbons C5-C8; Experimental data and an estimation method,
Collect. Czech. Chem. Commun., 1979, 44, 3, 637-651, https://doi.org/10.1135/cccc19790637
. [all data]
Reid, 1972
Reid, Robert C.,
Handbook on vapor pressure and heats of vaporization of hydrocarbons and related compounds, R. C. Wilhort and B. J. Zwolinski, Texas A Research Foundation. College Station, Texas(1971). 329 pages.$10.00,
AIChE J., 1972, 18, 6, 1278-1278, https://doi.org/10.1002/aic.690180637
. [all data]
Stephenson and Malanowski, 1987
Stephenson, Richard M.; Malanowski, Stanislaw,
Handbook of the Thermodynamics of Organic Compounds, 1987, https://doi.org/10.1007/978-94-009-3173-2
. [all data]
Forziati, Norris, et al., 1949
Forziati, Alphonse F.; Norris, William R.; Rossini, Frederick D.,
Vapor pressures and boiling points of sixty API-NBS hydrocarbons,
J. RES. NATL. BUR. STAN., 1949, 43, 6, 555-17, https://doi.org/10.6028/jres.043.050
. [all data]
Forziati, Norris, et al., 1949, 2
Forziati, A.F.; Norris, W.R.; Rossini, F.D.,
Vapor Pressures and Boiling Points of Sixty API-NBS Hydrocarbons,
J. Res. Natl. Bur. Stand. (U.S.), 1949, 43, 6, 555-563, https://doi.org/10.6028/jres.043.050
. [all data]
Rogers and Dejroongruang, 1988
Rogers, D.W.; Dejroongruang, K.,
Enthalpies of hydrogenation of the n-heptenes and the methylhexenes,
J. Chem. Thermodyn., 1988, 20, 675-680. [all data]
Rogers and Dejroongruang, 1989
Rogers, D.W.; Dejroongruang, K.,
Enthalpies of hydrogenation of the dimethylpentenes, ethylpentenes, methylbutene, and trimethylbutene,
J. Chem. Thermodyn., 1989, 21, 1115-1120. [all data]
Roganov, Kabo, et al., 1972
Roganov, G.N.; Kabo, G.Ya.; Andreevskii, D.N.,
Thermodynamics of the isomerization of methylpentanes and methylheptanes,
Neftekhimiya, 1972, 12, 495-500. [all data]