1H-Pyrrole, 1-butyl-
- Formula: C8H13N
- Molecular weight: 123.1955
- IUPAC Standard InChIKey: IIYSNNBEZBAQCQ-UHFFFAOYSA-N
- CAS Registry Number: 589-33-3
- Chemical structure:
View 3d structure (requires JavaScript / HTML 5) - Other names: Pyrrole, 1-butyl-; N-Butylpyrrole; 1-Butylpyrrole; 1-n-Butylpyrrole; Pyrrole, 1-n-butyl-; 1-Butyl-1H-pyrrole

Phase change data

Data compiled by: Thermodynamics Research Center, NIST Boulder Laboratories, Chris Muzny director
Quantity | Value | Units | Method | Reference | Comment |
---|---|---|---|---|---|
Tfus | 207.05 | K | N/A | Lanum and Morris, 1969 | Uncertainty assigned by TRC = 0.3 K |

References

Lanum and Morris, 1969
Lanum, W.J.; Morris, J.C.,
Physical Properties of Some Sulfur and Nitrogen Compounds,
J. Chem. Eng. Data, 1969, 14, 93-8. [all data]