(E)-9-Octadecenoic acid pentyl ester

Condensed phase thermochemistry data

Data compiled by: Hussein Y. Afeefy, Joel F. Liebman, and Stephen E. Stein

Quantity Value Units Method Reference Comment
Δcliquid-14488. ± 15.kJ/molCcbKeffler, 1937Reanalyzed by Cox and Pilcher, 1970, Original value = -14462. kJ/mol; See Keffler and McLean, 1935; Corresponding Δfliquid = -850.65 kJ/mol (simple calculation by NIST; no Washburn corrections)

References

Keffler, 1937
Keffler, L.J.P., Homology and isomerism in long-chain compounds. I. A thermochemical study of the n-alkyl esters derived from the monoethylenic monocarboxylic acids in C18, J. Phys. Chem., 1937, 41, 715-721. [all data]

Cox and Pilcher, 1970
Cox, J.D.; Pilcher, G., Thermochemistry of Organic and Organometallic Compounds, Academic Press, New York, 1970, 1-636. [all data]

Keffler and McLean, 1935
Keffler, L.; McLean, J.H., Homology in long-chain compounds, I. Oleic acid and the n-alkul oleates, J. Soc. Chem. Ind., 1935, 178-185. [all data]