4-bromophenylhydrazine
- Formula: C6H7BrN2
- Molecular weight: 187.037
- IUPAC Standard InChIKey: NRESDXFFSNBDGP-UHFFFAOYSA-N
- CAS Registry Number: 589-21-9
- Chemical structure:
View 3d structure (requires JavaScript / HTML 5) - Other names: (p-bromophenyl)hydrazine

Phase change data

Data compiled by: Thermodynamics Research Center, NIST Boulder Laboratories, Chris Muzny director
Quantity | Value | Units | Method | Reference | Comment |
---|---|---|---|---|---|
Tfus | 406.65 | K | N/A | Popp, 1964 | Uncertainty assigned by TRC = 2. K |

References

Popp, 1964
Popp, F.D.,
Some Derivatives of 3-Bromobenzaldehyde,
J. Chem. Eng. Data, 1964, 9, 381. [all data]