Benzene, 1-bromo-4-(chloromethyl)-
- Formula: C7H6BrCl
- Molecular weight: 205.480
- IUPAC Standard InChIKey: BSIIGUGKOPPTPZ-UHFFFAOYSA-N
- CAS Registry Number: 589-17-3
- Chemical structure:
View 3d structure (requires JavaScript / HTML 5) - Other names: 1-bromo-4-(chloromethyl)benzene

Phase change data

Data compiled as indicated in comments:
BS - Robert L. Brown and Stephen E. Stein
TRC - Thermodynamics Research Center, NIST Boulder Laboratories, Chris Muzny director
Quantity | Value | Units | Method | Reference | Comment |
---|---|---|---|---|---|
Tboil | 511. | K | N/A | Buckingham and Donaghy, 1982 | BS |
Quantity | Value | Units | Method | Reference | Comment |
Tfus | 323. | K | N/A | Buckingham and Donaghy, 1982 | BS |
Tfus | 314.9 | K | N/A | Blomquist and Westfahl, 1953 | Uncertainty assigned by TRC = 4. K; TRC |

References

Buckingham and Donaghy, 1982
Buckingham, J.; Donaghy, S.M.,
Dictionary of Organic Compounds: Fifth Edition, Chapman and Hall, New York, 1982, 1. [all data]
Blomquist and Westfahl, 1953
Blomquist, A.T.; Westfahl, J.C.,
2-Neopentyl-1,3-butadiene Dimer,
J. Am. Chem. Soc., 1953, 75, 2304. [all data]