2-Pentanone, 5-chloro-
- Formula: C5H9ClO
- Molecular weight: 120.577
- IUPAC Standard InChIKey: XVRIEWDDMODMGA-UHFFFAOYSA-N
- CAS Registry Number: 5891-21-4
- Chemical structure:
View 3d structure (requires JavaScript / HTML 5) - Other names: 1-Chloro-4-pentanone; 3-Chloropropyl methyl ketone; 5-Chloro-2-pentanone; 3-Acetylpropyl chloride; 5-chloropentan-2-one

Phase change data

Data compiled by: Robert L. Brown and Stephen E. Stein
Reduced pressure boiling point
Tboil (K) | Pressure (bar) | Reference |
---|---|---|
344.7 | 0.027 | Aldrich Chemical Company Inc., 1990 |

Normal alkane RI, non-polar column, temperature ramp

Column type | Active phase | I | Reference | Comment |
---|---|---|---|---|
Capillary | OV-101 | 965. | Zenkevich, 2005 | 25. m/0.20 mm/0.10 μm, N2/He, 6. K/min; Tstart: 50. C; Tend: 250. C |

References

Aldrich Chemical Company Inc., 1990
Aldrich Chemical Company Inc.,
Catalog Handbook of Fine Chemicals, Aldrich Chemical Company, Inc., Milwaukee WI, 1990, 1. [all data]
Zenkevich, 2005
Zenkevich, I.G.,
Experimentally measured retention indices., 2005. [all data]