(E)-1-(2-Furyl)-1-methoxypropene
- Formula: C8H10O2
- Molecular weight: 138.1638
- IUPAC Standard InChIKey: PMQPDXCTTGGZDB-XVNBXDOJSA-N
- CAS Registry Number: 58890-02-1
- Chemical structure:
View 3d structure (requires JavaScript / HTML 5) - Stereoisomers:

Reaction thermochemistry data

Data compiled by: Hussein Y. Afeefy, Joel F. Liebman, and Stephen E. Stein
Individual Reactions
By formula: C8H10O2 = C8H10O2
Quantity | Value | Units | Method | Reference | Comment |
---|---|---|---|---|---|
ΔrH° | 1.2 ± 0.8 | kJ/mol | Eqk | Taskinen and Mustonen, 1976 | liquid phase; solvent: Cyclohexane |

References

Taskinen and Mustonen, 1976
Taskinen, E.; Mustonen, E.,
Thermodynamics of vinyl ethers. XIV. Effect of aromatic and heteroaromatic α-substituents on the relative stabilities of geometric isomers,
Acta Chem. Scand., Ser. B, 1976, 30, 1-4. [all data]