(E)-1-(2-Methyoxyphenyl)-1-methoxypropene
- Formula: C11H14O2
- Molecular weight: 178.2277
- IUPAC Standard InChIKey: MMFDECPWOHMXEU-ONNFQVAWSA-N
- CAS Registry Number: 58889-98-8
- Chemical structure:
View 3d structure (requires JavaScript / HTML 5) - Stereoisomers:

Reaction thermochemistry data

Data compiled by: Hussein Y. Afeefy, Joel F. Liebman, and Stephen E. Stein
Individual Reactions
By formula: C11H14O2 = C11H14O2
Quantity | Value | Units | Method | Reference | Comment |
---|---|---|---|---|---|
ΔrH° | 3.8 ± 0.7 | kJ/mol | Eqk | Taskinen and Mustonen, 1976 | liquid phase; solvent: Cyclohexane |

References

Taskinen and Mustonen, 1976
Taskinen, E.; Mustonen, E.,
Thermodynamics of vinyl ethers. XIV. Effect of aromatic and heteroaromatic α-substituents on the relative stabilities of geometric isomers,
Acta Chem. Scand., Ser. B, 1976, 30, 1-4. [all data]