(E)-1-(3-Methylphenyl)-1-methoxypropene
- Formula: C11H14O
- Molecular weight: 162.2283
- IUPAC Standard InChIKey: WQPOHMFNFWHCII-NYYWCZLTSA-N
- CAS Registry Number: 58889-94-4
- Chemical structure:
View 3d structure (requires JavaScript / HTML 5) - Stereoisomers:

Reaction thermochemistry data

Data compiled by: Hussein Y. Afeefy, Joel F. Liebman, and Stephen E. Stein
Individual Reactions
By formula: C11H14O = C11H14O
Quantity | Value | Units | Method | Reference | Comment |
---|---|---|---|---|---|
ΔrH° | 0.02 ± 0.07 | kcal/mol | Eqk | Taskinen and Mustonen, 1976 | liquid phase; solvent: Cyclohexane |

References

Taskinen and Mustonen, 1976
Taskinen, E.; Mustonen, E.,
Thermodynamics of vinyl ethers. XIV. Effect of aromatic and heteroaromatic α-substituents on the relative stabilities of geometric isomers,
Acta Chem. Scand., Ser. B, 1976, 30, 1-4. [all data]