1,2-Dimethoxy-4-n-propylbenzene
- Formula: C11H16O2
- Molecular weight: 180.2435
- IUPAC Standard InChIKey: YXLFQKUIZVSIEP-UHFFFAOYSA-N
- CAS Registry Number: 5888-52-8
- Chemical structure:
View 3d structure (requires JavaScript / HTML 5) - Other names: Benzene, 1,2-dimethoxy-4-propyl-; Dihydromethyleugenol; 1,2-Dimethoxy-4-propylbenzene

Phase change data

Data compiled by: Robert L. Brown and Stephen E. Stein
Reduced pressure boiling point
Tboil (K) | Pressure (bar) | Reference |
---|---|---|
416. to 418. | 0.027 | Frinton Laboratories Inc., 1986 |

References

Frinton Laboratories Inc., 1986
Frinton Laboratories Inc.,
Catalog Number 11, Frinton Laboratories Inc., Vineland, NJ, 1986, 99. [all data]