Benzene, (butoxymethyl)-
- Formula: C11H16O
- Molecular weight: 164.2441
- IUPAC Standard InChIKey: MAYUYFCAPVDYBQ-UHFFFAOYSA-N
- CAS Registry Number: 588-67-0
- Chemical structure:
View 3d structure (requires JavaScript / HTML 5) - Other names: Ether, benzyl butyl; Benzyl butyl ether; Benzyl n-butyl ether; n-Butyl benzyl ether; Ether, benzyl n-butyl

Phase change data

Data compiled by: Robert L. Brown and Stephen E. Stein
Reduced pressure boiling point
Tboil (K) | Pressure (bar) | Reference |
---|---|---|
365. | 0.013 | Buckingham and Donaghy, 1982 |

Normal alkane RI, non-polar column, custom temperature program

Column type | Active phase | I | Reference | Comment |
---|---|---|---|---|
Capillary | SE-30 | 1238. | Vinogradov, 2004 | Program: not specified |

Normal alkane RI, polar column, custom temperature program

Column type | Active phase | I | Reference | Comment |
---|---|---|---|---|
Capillary | Carbowax 20M | 1613. | Vinogradov, 2004 | Program: not specified |

References

Buckingham and Donaghy, 1982
Buckingham, J.; Donaghy, S.M.,
Dictionary of Organic Compounds: Fifth Edition, Chapman and Hall, New York, 1982, 1. [all data]
Vinogradov, 2004
Vinogradov, B.A.,
Production, composition, properties and application of essential oils, 2004, retrieved from http://viness.narod.ru. [all data]