4,4'-Azodiphenetole

Condensed phase thermochemistry data

Data compiled by: Hussein Y. Afeefy, Joel F. Liebman, and Stephen E. Stein

Quantity Value Units Method Reference Comment
Δfsolid-9.6kcal/molCcbLemoult, 1908
Quantity Value Units Method Reference Comment
Δcsolid-2110.1kcal/molCcbLemoult, 1908

References

Lemoult, 1908
Lemoult, M.P., Recherches theoriques et experimentales sur les chaleurs de combustion et de formation des composes organiques, Ann. Chim. Phys., 1908, 14, 289-310. [all data]