Bicyclo[2.2.1]hept-5-ene-2,3-dicarboxylic acid, diethyl ester
- Formula: C13H18O4
- Molecular weight: 238.2796
- IUPAC Standard InChIKey: UXRMRBNLTQHPEU-UHFFFAOYSA-N
- CAS Registry Number: 5883-33-0
- Chemical structure:
View 3d structure (requires JavaScript / HTML 5) - Other names: Diethyl bicyclo[2.2.1]hept-5-ene-2,3-dicarboxylate

Van Den Dool and Kratz RI, non-polar column, custom temperature program

Column type | Active phase | I | Reference | Comment |
---|---|---|---|---|
Capillary | VF-5MS | 1561. | Tretyakov, 2011 | 30. m/0.25 mm/0.25 μm, He; Program: Multi-step temperature program; T(initial)=60C; T(final)=270C |

References

Tretyakov, 2011
Tretyakov, K.V.,
Retention Data. NIST Mass Spectrometry Data Center., NIST Mass Spectrometry Data Center, 2011. [all data]